{"text_format":"1","workbook":"xlsx","n_sheets":4,"sheets":["IDENTIFICATION","Price List","Service Parts","Obsolete"],"not_rendered":{"charts":0,"images":1,"macros":0,"external_links":0,"defined_names":4,"comments":0,"pivot_tables":0},"unopened":[],"bounds":{"document_bytes":16777216,"sheet_cells":100000,"rows_first":2000,"rows_last":500,"rows_between":2000,"halvings":0,"cell_chars":16384,"cell_head_chars":4096},"cells_cut":0,"cells_raw":0,"read":"whole","date_system":"1900"}

{"sheet":"IDENTIFICATION","index":0,"n_rows":25,"n_cols":22,"rows_kept":25,"cut":false,"hidden":false,"merged":[[1,5,1,6]]}
[null,"JABSCO PUMP PARTS AND PRICES",null,null,null,"LANCING MARINE ",null,null,"CALL LANCING MARNE TO ORDER 01273-410025",null,null,null,null,null,null,null,null,null,null,null,"ADMIN","ADMIN"]
[null,"MODEL NUMBER","DESCRIPTION","PRICE",null,{"$f":"HYPERLINK(\"mailto:DATA@LANCINGMARINE.COM\", \"Email: Data@Lancingmarine.com\")","v":"Email: Data@Lancingmarine.com"},null,null,"+44-1273-41005"]
[null,"52200-2011",{"$f":"IFERROR(INDEX('Price List'!B:B,MATCH(B3,'Price List'!A:A,0),1),\"NOT-FOUND\")","v":"EU PMP 1 1/2 BSP PED NEO 200"},{"$f":"IFERROR(INDEX('Price List'!E:E,MATCH(B3,'Price List'!A:A,0),1),\"NOT-FOUND\")","v":553.4}]
[null,"PORT TYPE","PUMP SIZE","MOUNT TYPE",null,"ALTERNATIVE MODEL","DESCRIPTION","WEIGHT","PRICEBOOK"]
[null,{"$f":"IFERROR(INDEX('Service Parts'!C:C,MATCH(B3,'Service Parts'!A:A,0),1),\"-\")","v":"1-1/2\" BSP"},{"$f":"IFERROR(INDEX('Service Parts'!B:B,MATCH(B3,'Service Parts'!A:A,0),1),\"-\")","v":200},{"$f":"IFERROR(INDEX('Service Parts'!D:D,MATCH(B3,'Service Parts'!A:A,0),1),\"-\")","v":"Foot"},null,{"$f":"IFERROR(INDEX(Obsolete!C:C,MATCH(B3,Obsolete!B:B,0),1),\"-\")","v":"-"},{"$f":"IFERROR(INDEX('Price List'!B:B,IF(U5=\"-\",V5,U5),1),\"-\")","v":"-"},{"$f":"IFERROR(INDEX('Price List'!D:D,U5,1),\"-\")","v":"-"},{"$f":"IFERROR(INDEX('Price List'!E:E,U5,1),\"-\")","v":"-"},null,null,null,null,null,null,null,null,null,null,null,{"$f":"IFERROR(MATCH(F5,'Price List'!A:A,0),\"-\")","v":"-"},"-"]
[]
[null,"COMPONENT","PART-NUM-VALUE","ALTERNATIVE-PART",null,"PART-NUM-VALUE","DESCRIPTION","WEIGHT","PRICEBOOK",null,"LINK","URL",null,null,null,null,null,null,null,null,"ROW","ALT-ROW"]
[null,"KIT NUMBER",{"$f":"IFERROR(INDEX('Service Parts'!F:F,MATCH(B3,'Service Parts'!A:A,0),1),\"-\")","v":"SK407-0011"},{"$f":"IFERROR(INDEX(Obsolete!C:C,MATCH(TRIM(C8),Obsolete!B:B,0),1),\"-\")","v":"-"},null,{"$f":"IFERROR(INDEX('Price List'!A:A,IF(U9=\"-\",V9,U9),1),\"NOT-FOUND\")","v":"SK407-0011"},{"$f":"IFERROR(INDEX('Price List'!B:B,IF(U9=\"-\",V9,U9),1),\"-\")","v":"KIT SERVICE 200 MP NEO"},{"$f":"IFERROR(INDEX('Price List'!D:D,IF(U9=\"-\",V9,U9),1),\"-\")","v":0.48699999999999999},{"$f":"IFERROR(INDEX('Price List'!E:E,IF(U9=\"-\",V9,U9),1),\"-\")","v":183.3},null,{"$f":"HYPERLINK(L8,\"LANCING MARINE\")","v":"LANCING MARINE"},"https://www.lancingmarine.com/",null,null,null,null,null,null,null,null,{"$f":"IFERROR(MATCH(C23,'Price List'!A:A,0),\"-\")","v":"-"},{"$f":"IFERROR(MATCH(D23,'Price List'!A:A,0),\"-\")","v":"-"}]
[null,"GASKET/ O-RING",{"$f":"IFERROR(INDEX('Service Parts'!G:G,MATCH(B3,'Service Parts'!A:A,0),1),\"-\")","v":816},{"$f":"IFERROR(INDEX(Obsolete!C:C,MATCH(TRIM(C9),Obsolete!B:B,0),1),\"-\")","v":"-"},null,{"$f":"IFERROR(INDEX('Price List'!A:A,IF(U10=\"-\",V10,U10),1),\"NOT-FOUND\")","v":"NOT-FOUND"},{"$f":"IFERROR(INDEX('Price List'!B:B,IF(U10=\"-\",V10,U10),1),\"-\")","v":"-"},{"$f":"IFERROR(INDEX('Price List'!D:D,IF(U10=\"-\",V10,U10),1),\"-\")","v":"-"},{"$f":"IFERROR(INDEX('Price List'!E:E,IF(U10=\"-\",V10,U10),1),\"-\")","v":"-"},null,{"$f":"HYPERLINK(L9,\"SEA WATER PUMPS\")","v":"SEA WATER PUMPS"},"https://www.lancingmarine.com/price-book/page-33/",null,null,null,null,null,null,null,null,{"$f":"IFERROR(MATCH(C8,'Price List'!A:A,0),\"-\")","v":58},{"$f":"IFERROR(MATCH(D8,'Price List'!A:A,0),\"-\")","v":"-"}]
[null,"IMPELLER",{"$f":"IFERROR(INDEX('Service Parts'!H:H,MATCH(B3,'Service Parts'!A:A,0),1),\"-\")","v":"17935-0001-P"},{"$f":"IFERROR(INDEX(Obsolete!C:C,MATCH(TRIM(C10),Obsolete!B:B,0),1),\"-\")","v":"-"},null,{"$f":"IFERROR(INDEX('Price List'!A:A,IF(U11=\"-\",V11,U11),1),\"NOT-FOUND\")","v":"17935-0001-P"},{"$f":"IFERROR(INDEX('Price List'!B:B,IF(U11=\"-\",V11,U11),1),\"-\")","v":"KIT IMPELLER POS"},{"$f":"IFERROR(INDEX('Price List'!D:D,IF(U11=\"-\",V11,U11),1),\"-\")","v":0.59},{"$f":"IFERROR(INDEX('Price List'!E:E,IF(U11=\"-\",V11,U11),1),\"-\")","v":46.7},null,{"$f":"HYPERLINK(L10,\"ABOUT JABSCO\")","v":"ABOUT JABSCO"},"https://www.lancingmarine.com/blog/jabsco-full-spare-patrs-lists.aspx",null,null,null,null,null,null,null,null,{"$f":"IFERROR(MATCH(C9,'Price List'!A:A,0),\"-\")","v":"-"},{"$f":"IFERROR(MATCH(D9,'Price List'!A:A,0),\"-\")","v":"-"}]
[null,"WATER SEAL",{"$f":"IFERROR(INDEX('Service Parts'!I:I,MATCH(B3,'Service Parts'!A:A,0),1),\"-\")","v":21849},{"$f":"IFERROR(INDEX(Obsolete!C:C,MATCH(TRIM(C11),Obsolete!B:B,0),1),\"-\")","v":"-"},null,{"$f":"IFERROR(INDEX('Price List'!A:A,IF(U12=\"-\",V12,U12),1),\"NOT-FOUND\")","v":21849},{"$f":"IFERROR(INDEX('Price List'!B:B,IF(U12=\"-\",V12,U12),1),\"-\")","v":"KIT MECHANICAL SEAL"},{"$f":"IFERROR(INDEX('Price List'!D:D,IF(U12=\"-\",V12,U12),1),\"-\")","v":0.05},{"$f":"IFERROR(INDEX('Price List'!E:E,IF(U12=\"-\",V12,U12),1),\"-\")","v":76.3},null,{"$f":"HYPERLINK(L11,\"FULL JABSCO PUMP LISTS\")","v":"FULL JABSCO PUMP LISTS"},"https://www.lancingmarine.com/price-book/page-84/",null,null,null,null,null,null,null,null,{"$f":"IFERROR(MATCH(C10,'Price List'!A:A,0),\"-\")","v":200},{"$f":"IFERROR(MATCH(D10,'Price List'!A:A,0),\"-\")","v":"-"}]
[null,"END COVER SCREWS",{"$f":"IFERROR(INDEX('Service Parts'!J:J,MATCH(B3,'Service Parts'!A:A,0),1),\"-\")","v":"X3001-176F"},{"$f":"IFERROR(INDEX(Obsolete!C:C,MATCH(TRIM(C12),Obsolete!B:B,0),1),\"-\")","v":"X3003-176F-P"},null,{"$f":"IFERROR(INDEX('Price List'!A:A,IF(U13=\"-\",V13,U13),1),\"NOT-FOUND\")","v":"X3003-176F-P"},{"$f":"IFERROR(INDEX('Price List'!B:B,IF(U13=\"-\",V13,U13),1),\"-\")","v":"SCREW M6 X 10"},{"$f":"IFERROR(INDEX('Price List'!D:D,IF(U13=\"-\",V13,U13),1),\"-\")","v":1E-3},{"$f":"IFERROR(INDEX('Price List'!E:E,IF(U13=\"-\",V13,U13),1),\"-\")","v":10.3},null,{"$f":"HYPERLINK(L12,\"JABSCO PUMP SERVICE REPAIR KITS\")","v":"JABSCO PUMP SERVICE REPAIR KITS"},"https://www.lancingmarine.com/price-book/page-85/",null,null,null,null,null,null,null,null,{"$f":"IFERROR(MATCH(C11,'Price List'!A:A,0),\"-\")","v":268},{"$f":"IFERROR(MATCH(D11,'Price List'!A:A,0),\"-\")","v":"-"}]
[null,"CAM",{"$f":"IFERROR(INDEX('Service Parts'!K:K,MATCH(B3,'Service Parts'!A:A,0),1),\"-\")","v":834},{"$f":"IFERROR(INDEX(Obsolete!C:C,MATCH(TRIM(C13),Obsolete!B:B,0),1),\"-\")","v":"834-0001"},null,{"$f":"IFERROR(INDEX('Price List'!A:A,IF(U14=\"-\",V14,U14),1),\"NOT-FOUND\")","v":"834-0001"},{"$f":"IFERROR(INDEX('Price List'!B:B,IF(U14=\"-\",V14,U14),1),\"-\")","v":"KIT CAM"},{"$f":"IFERROR(INDEX('Price List'!D:D,IF(U14=\"-\",V14,U14),1),\"-\")","v":0.39500000000000002},{"$f":"IFERROR(INDEX('Price List'!E:E,IF(U14=\"-\",V14,U14),1),\"-\")","v":36.700000000000003},null,{"$f":"HYPERLINK(L13,\"JABSCO COMPONENTS\")","v":"JABSCO COMPONENTS"},"https://www.lancingmarine.com/price-book/page-86/",null,null,null,null,null,null,null,null,{"$f":"IFERROR(MATCH(C12,'Price List'!A:A,0),\"-\")","v":"-"},{"$f":"IFERROR(MATCH(D12,'Price List'!A:A,0),\"-\")","v":112}]
[null,"CAM SCREW",{"$f":"IFERROR(INDEX('Service Parts'!L:L,MATCH(B3,'Service Parts'!A:A,0),1),\"-\")","v":"SP1005-04"},{"$f":"IFERROR(INDEX(Obsolete!C:C,MATCH(TRIM(C14),Obsolete!B:B,0),1),\"-\")","v":"-"},null,{"$f":"IFERROR(INDEX('Price List'!A:A,IF(U15=\"-\",V15,U15),1),\"NOT-FOUND\")","v":"NOT-FOUND"},{"$f":"IFERROR(INDEX('Price List'!B:B,IF(U15=\"-\",V15,U15),1),\"-\")","v":"-"},{"$f":"IFERROR(INDEX('Price List'!D:D,IF(U15=\"-\",V15,U15),1),\"-\")","v":"-"},{"$f":"IFERROR(INDEX('Price List'!E:E,IF(U15=\"-\",V15,U15),1),\"-\")","v":"-"},null,null,null,null,null,null,null,null,null,null,null,{"$f":"IFERROR(MATCH(C13,'Price List'!A:A,0),\"-\")","v":"-"},{"$f":"IFERROR(MATCH(D13,'Price List'!A:A,0),\"-\")","v":527}]
[null,"PUMP END OIL SEAL",{"$f":"IFERROR(INDEX('Service Parts'!M:M,MATCH(B3,'Service Parts'!A:A,0),1),\"-\")","v":"SP2700-50"},{"$f":"IFERROR(INDEX(Obsolete!C:C,MATCH(TRIM(C15),Obsolete!B:B,0),1),\"-\")","v":"-"},null,{"$f":"IFERROR(INDEX('Price List'!A:A,IF(U16=\"-\",V16,U16),1),\"NOT-FOUND\")","v":"NOT-FOUND"},{"$f":"IFERROR(INDEX('Price List'!B:B,IF(U16=\"-\",V16,U16),1),\"-\")","v":"-"},{"$f":"IFERROR(INDEX('Price List'!D:D,IF(U16=\"-\",V16,U16),1),\"-\")","v":"-"},{"$f":"IFERROR(INDEX('Price List'!E:E,IF(U16=\"-\",V16,U16),1),\"-\")","v":"-"},null,null,null,null,null,null,null,null,null,null,null,{"$f":"IFERROR(MATCH(C14,'Price List'!A:A,0),\"-\")","v":"-"},{"$f":"IFERROR(MATCH(D14,'Price List'!A:A,0),\"-\")","v":"-"}]
[null,"PUMP END BEARING",{"$f":"IFERROR(INDEX('Service Parts'!N:N,MATCH(B3,'Service Parts'!A:A,0),1),\"-\")","v":"SP2600-04"},{"$f":"IFERROR(INDEX(Obsolete!C:C,MATCH(TRIM(C16),Obsolete!B:B,0),1),\"-\")","v":"-"},null,{"$f":"IFERROR(INDEX('Price List'!A:A,IF(U17=\"-\",V17,U17),1),\"NOT-FOUND\")","v":"NOT-FOUND"},{"$f":"IFERROR(INDEX('Price List'!B:B,IF(U17=\"-\",V17,U17),1),\"-\")","v":"-"},{"$f":"IFERROR(INDEX('Price List'!D:D,IF(U17=\"-\",V17,U17),1),\"-\")","v":"-"},{"$f":"IFERROR(INDEX('Price List'!E:E,IF(U17=\"-\",V17,U17),1),\"-\")","v":"-"},null,null,null,null,null,null,null,null,null,null,null,{"$f":"IFERROR(MATCH(C15,'Price List'!A:A,0),\"-\")","v":"-"},{"$f":"IFERROR(MATCH(D15,'Price List'!A:A,0),\"-\")","v":"-"}]
[null,"DRIVE END OIL SEAL",{"$f":"IFERROR(INDEX('Service Parts'!O:O,MATCH(B3,'Service Parts'!A:A,0),1),\"-\")","v":"SP2701-1013"},{"$f":"IFERROR(INDEX(Obsolete!C:C,MATCH(TRIM(C17),Obsolete!B:B,0),1),\"-\")","v":"-"},null,{"$f":"IFERROR(INDEX('Price List'!A:A,IF(U18=\"-\",V18,U18),1),\"NOT-FOUND\")","v":"NOT-FOUND"},{"$f":"IFERROR(INDEX('Price List'!B:B,IF(U18=\"-\",V18,U18),1),\"-\")","v":"-"},{"$f":"IFERROR(INDEX('Price List'!D:D,IF(U18=\"-\",V18,U18),1),\"-\")","v":"-"},{"$f":"IFERROR(INDEX('Price List'!E:E,IF(U18=\"-\",V18,U18),1),\"-\")","v":"-"},null,null,null,null,null,null,null,null,null,null,null,{"$f":"IFERROR(MATCH(C16,'Price List'!A:A,0),\"-\")","v":"-"},{"$f":"IFERROR(MATCH(D16,'Price List'!A:A,0),\"-\")","v":"-"}]
[null,"DRIVE END BEARING",{"$f":"IFERROR(INDEX('Service Parts'!P:P,MATCH(B3,'Service Parts'!A:A,0),1),\"-\")","v":0},{"$f":"IFERROR(INDEX(Obsolete!C:C,MATCH(TRIM(C18),Obsolete!B:B,0),1),\"-\")","v":"-"},null,{"$f":"IFERROR(INDEX('Price List'!A:A,IF(U19=\"-\",V19,U19),1),\"NOT-FOUND\")","v":"NOT-FOUND"},{"$f":"IFERROR(INDEX('Price List'!B:B,IF(U19=\"-\",V19,U19),1),\"-\")","v":"-"},{"$f":"IFERROR(INDEX('Price List'!D:D,IF(U19=\"-\",V19,U19),1),\"-\")","v":"-"},{"$f":"IFERROR(INDEX('Price List'!E:E,IF(U19=\"-\",V19,U19),1),\"-\")","v":"-"},null,null,null,null,null,null,null,null,null,null,null,{"$f":"IFERROR(MATCH(C17,'Price List'!A:A,0),\"-\")","v":"-"},{"$f":"IFERROR(MATCH(D17,'Price List'!A:A,0),\"-\")","v":"-"}]
[null,"SHAFT",{"$f":"IFERROR(INDEX('Service Parts'!Q:Q,MATCH(B3,'Service Parts'!A:A,0),1),\"-\")","v":"52207-0000"},{"$f":"IFERROR(INDEX(Obsolete!C:C,MATCH(TRIM(C19),Obsolete!B:B,0),1),\"-\")","v":"-"},null,{"$f":"IFERROR(INDEX('Price List'!A:A,IF(U20=\"-\",V20,U20),1),\"NOT-FOUND\")","v":"52207-0000"},{"$f":"IFERROR(INDEX('Price List'!B:B,IF(U20=\"-\",V20,U20),1),\"-\")","v":"SHAFT 200"},{"$f":"IFERROR(INDEX('Price List'!D:D,IF(U20=\"-\",V20,U20),1),\"-\")","v":0.59299999999999997},{"$f":"IFERROR(INDEX('Price List'!E:E,IF(U20=\"-\",V20,U20),1),\"-\")","v":303.60000000000002},null,null,null,null,null,null,null,null,null,null,null,{"$f":"IFERROR(MATCH(C18,'Price List'!A:A,0),\"-\")","v":"-"},{"$f":"IFERROR(MATCH(D18,'Price List'!A:A,0),\"-\")","v":"-"}]
[null,"WEARPLATE",{"$f":"IFERROR(INDEX('Service Parts'!R:R,MATCH(B3,'Service Parts'!A:A,0),1),\"-\")","v":2574},{"$f":"IFERROR(INDEX(Obsolete!C:C,MATCH(TRIM(C20),Obsolete!B:B,0),1),\"-\")","v":"2574-0000"},null,{"$f":"IFERROR(INDEX('Price List'!A:A,IF(U21=\"-\",V21,U21),1),\"NOT-FOUND\")","v":"2574-0000"},{"$f":"IFERROR(INDEX('Price List'!B:B,IF(U21=\"-\",V21,U21),1),\"-\")","v":"KIT WEARPLATE"},{"$f":"IFERROR(INDEX('Price List'!D:D,IF(U21=\"-\",V21,U21),1),\"-\")","v":0.28999999999999998},{"$f":"IFERROR(INDEX('Price List'!E:E,IF(U21=\"-\",V21,U21),1),\"-\")","v":23.5},null,null,null,null,null,null,null,null,null,null,null,{"$f":"IFERROR(MATCH(C19,'Price List'!A:A,0),\"-\")","v":471},{"$f":"IFERROR(MATCH(D19,'Price List'!A:A,0),\"-\")","v":"-"}]
[null,"END COVER",{"$f":"IFERROR(INDEX('Service Parts'!S:S,MATCH(B3,'Service Parts'!A:A,0),1),\"-\")","v":9336},{"$f":"IFERROR(INDEX(Obsolete!C:C,MATCH(TRIM(C21),Obsolete!B:B,0),1),\"-\")","v":"10773-0000"},null,{"$f":"IFERROR(INDEX('Price List'!A:A,IF(U22=\"-\",V22,U22),1),\"NOT-FOUND\")","v":"10773-0000"},{"$f":"IFERROR(INDEX('Price List'!B:B,IF(U22=\"-\",V22,U22),1),\"-\")","v":"END COVER BRASS 200/270"},{"$f":"IFERROR(INDEX('Price List'!D:D,IF(U22=\"-\",V22,U22),1),\"-\")","v":1E-3},{"$f":"IFERROR(INDEX('Price List'!E:E,IF(U22=\"-\",V22,U22),1),\"-\")","v":127.6},null,null,null,null,null,null,null,null,null,null,null,{"$f":"IFERROR(MATCH(C20,'Price List'!A:A,0),\"-\")","v":"-"},{"$f":"IFERROR(MATCH(D20,'Price List'!A:A,0),\"-\")","v":318}]
[null,"BODY",{"$f":"IFERROR(INDEX('Service Parts'!T:T,MATCH(B3,'Service Parts'!A:A,0),1),\"-\")","v":"50204-2100"},{"$f":"IFERROR(INDEX(Obsolete!C:C,MATCH(TRIM(C22),Obsolete!B:B,0),1),\"-\")","v":"-"},null,{"$f":"IFERROR(INDEX('Price List'!A:A,IF(U23=\"-\",V23,U23),1),\"NOT-FOUND\")","v":"NOT-FOUND"},{"$f":"IFERROR(INDEX('Price List'!B:B,IF(U23=\"-\",V23,U23),1),\"-\")","v":"-"},{"$f":"IFERROR(INDEX('Price List'!D:D,IF(U23=\"-\",V23,U23),1),\"-\")","v":"-"},{"$f":"IFERROR(INDEX('Price List'!E:E,IF(U23=\"-\",V23,U23),1),\"-\")","v":"-"},null,null,null,null,null,null,null,null,null,null,null,{"$f":"IFERROR(MATCH(C21,'Price List'!A:A,0),\"-\")","v":"-"},{"$f":"IFERROR(MATCH(D21,'Price List'!A:A,0),\"-\")","v":140}]
[null,"ALTERNATE PUMP NUMBER",{"$f":"IFERROR(INDEX('Service Parts'!E:E,MATCH(B3,'Service Parts'!A:A,0),1),\"-\")","v":0},{"$f":"IFERROR(INDEX(Obsolete!C:C,MATCH(TRIM(C23),Obsolete!B:B,0),1),\"-\")","v":"-"},null,{"$f":"IFERROR(INDEX('Price List'!A:A,IF(U8=\"-\",V8,U8),1),\"NOT-FOUND\")","v":"NOT-FOUND"},{"$f":"IFERROR(INDEX('Price List'!B:B,IF(U8=\"-\",V8,U8),1),\"-\")","v":"-"},{"$f":"IFERROR(INDEX('Price List'!D:D,IF(U8=\"-\",V8,U8),1),\"-\")","v":"-"},{"$f":"IFERROR(INDEX('Price List'!E:E,IF(U8=\"-\",V8,U8),1),\"-\")","v":"-"},null,null,null,null,null,null,null,null,null,null,null,{"$f":"IFERROR(MATCH(C22,'Price List'!A:A,0),\"-\")","v":"-"},{"$f":"IFERROR(MATCH(D22,'Price List'!A:A,0),\"-\")","v":"-"}]
[null,null,null,null,null,"LANCING MARINE ",null,null,"CALL LANCING MARNE TO ORDER 01273-410025"]
[null,null,null,null,null,"DATA@LANCINGMARINE.COM",null,null,"+44-1273-41005"]

{"sheet":"Price List","index":1,"n_rows":1230,"n_cols":7,"rows_kept":1230,"cut":false,"hidden":false,"merged":[]}
["LANCING MARINE JABSCO PUMPS AND PARTS PRICES",null,null,null,null,null,"V.A.T. extra on U.K. sales, except Channel Isles."]
["PART-NUM-VALUE","Description","Pack Qty","Weight","PRICE",null,"Packing & Carriage is extra, optimum time route & cost tailored to the clients needs."]
["CW403","PUMP KIT 3/4  WITH 127MM PULLEY",1,2.44,360.8]
["CW404","PUMP KIT 3/4  WITH 159MM PULLEY",1,2.88,374]
["CW532","12V MACERATOR WITH AMP CONNECTOR",1,2.5,316.8]
["K1-200","KIT PORT 38MM (1.5  ) BSP",1,0.84,174.6]
["K2-200","KIT PORT 50MM (2  ) BSP",1,0.95,198]
["SK211","KIT SERVICE 020 SP NEO",1,6.7000000000000004E-2,48.4]
["SK220","KIT SERVICE 080 SP NEO",1,0.219,82.1]
["SK221","KIT SERVICE 010 SP NEO",1,4.8000000000000001E-2,61.6]
["SK224","KIT SERVICE (WATER PUPPY)",1,0.05,41.1]
["SK224-01","KIT SERVICE (MAXI PUPPY)",1,5.0999999999999997E-2,45.5]
["SK225-01","KIT SERVICE 040 SP NEO",1,0.127,71.900000000000006]
["SK228","KIT SERVICE 020 SP NEO",1,7.0999999999999994E-2,55.7]
["SK229","KIT SERVICE 080 SP NEO",1,0.246,136.4]
["SK229-37","KIT SERVICE 080 SP NIO",1,0.246,143.69999999999999]
["SK23","KIT SERVICE 010 SP NEO",1,4.4999999999999998E-2,57.2]
["SK23-0101","KIT SERVICE 010 SP NEO",1,4.2000000000000003E-2,48.4]
["SK230","KIT SERVICE 200 SP NEO",1,0.48699999999999999,176]
["SK230-37","KIT SERVICE 200 SP NIO",1,0.438,189.2]
["SK234","KIT SERVICE 040 SP NEO",1,0.14000000000000001,79.2]
["SK236","KIT SERVICE 080 SP NEO",1,0.20799999999999999,80.7]
["SK236-37","KIT SERVICE 080 SP NIO",1,0.19400000000000001,80.7]
["SK238","KIT SERVICE 080 SP NEO",1,0.24099999999999999,146.69999999999999]
["SK239","KIT SERVICE 040 SP NEO",1,0.161,130.5]
["SK254","KIT SERVICE 270 MP NE0",1,1.04,262.60000000000002]
["SK268","KIT SERVICE 040 SP NEO",1,0.27200000000000002,151.1]
["SK268-01","KIT SERVICE 040 SP NEO",1,0.27200000000000002,156.9]
["SK269","KIT SERVICE 080 SP NEO",1,0.248,255.2]
["SK271","KIT SERVICE 040 SP NEO",1,0.29799999999999999,121.8]
{"$rows_left_out":1201}
{"sheet":"Service Parts","index":2,"n_rows":927,"n_cols":20,"rows_kept":927,"cut":false,"hidden":false,"merged":[]}
["JABSCO PUMP PARTS"]
["MODEL NUMBER","PUMP \nSIZE","PORT\nTYPE","MOUNT TYPE","ALTERNATE PUMP NUMBER","KIT NUMBER","GASKET/ O-RING","IMPELLER-P","WATER SEAL","END COVER SCREWS","CAM","CAM SCREW","PUMP END OIL SEAL","PUMP END BEARING","DRIVE END OIL SEAL","DRIVE END BEARING","SHAFT","WEARPLATE","END COVER","BODY"]
[3570,200,"1-3/4\"\nFlanged","Flange",null,"SK375-0101",816,"17935-0001-P",21849,"SP1005-04","Assy 7257","SP1005-04","SP2700-51",null,"SP2700-49","SP2600-04","3577-0020","Assy 7257",9336,3574]
[4160,80,"0  32 Hose","Flange",null,null,null,"-P"]
[4360,200,"1-1/2\"\nFlanged","Flange",null,"SK230",816,"836-0001-P",21849,"SP1005-04",834,"SP1005-04","SP2704-01","SP2600-20","SP2704-02","SP2600-20",4367,2574,9336,4364]
[4410,40,"1/2\" BSP","Flange",null,"SK242",4908,"4568-0001-P","SP2701-01","SP6060-02",6396,"SP1003-01",null,null,null,null,4417,5097,4905,4414]
[4760,20,"3/4\" BSP","Flange",null,"SK228","2995-0030","673-0001-P","SP2701-04","SP1002-01",4454,"SP1002-09",null,null,null,null,4766,4466,3992,4764]
[4780,10,"3/4\" BSP","Flange",null,"SK217",1126,"4528-0001-P","SP2701-09","SP1002-01","AL8-01","SP1002-01",null,null,null,null,"Assy 4787",null,"AL6-200",4784]
[4850,80,"0  32 Hose","Flange",9750,null,3101,"920-08-P","SP2700-06","SP1003-09",5418,"SP1003-09","SP2700-07","SP2601-19",null,"SP2601-04",4857,5419,4855,4854]
[4860,80,"0 32 Hose","Flange",9760,null,3101,"920-08-P","SP2700-06","SP1003-09",5418,"SP1003-09","SP2700-07","SP2600-07",null,"SP2600-01",4867,5419,4855,4854]
[5460,20,"3/8\" BSP","Flange",null,null,5466,"673-0001-P","SP2701-04","SP1011-01","2907-0001","SP1002-01",null,null,null,null,5467,null,5465,5464]
[5640,20,null,null,null,"SK228","2995-0030","673-0001-P","SP2701-04","SP1003-01",4454,"SP1002-01",null,null,null,null,5647,4466,null,5644]
[5870,5,"1/2\" BSP","Flange",null,null,5878,"12104-0001-P","SP2701-09","SP1002-09",5868,"SP1002-01","SP2701-09",null,null,null,5877,5876,5875,5874]
[6330,80,"0 32 Hose/ Flange","Flange",null,"SK237",890,"4325-0480-P","SP2701-06","SP1003-11",4329,"SP1004-09","SP2701-06","SP2600-13","SP2701-06","SP2600-13",4337,"3196-01 ext",6335,6334]
[6710,20,"3/4\" BSP","Flange",null,"SK241","2995-0030","673-0001-P","SP2701-04","SP1002-09",4454,"SP1002-02",null,null,null,null,6717,4466,3992,"4764-41"]
[9360,10,"1/4\" BSP","Foot",null,"SK223",1126,"4528-0001-P","AL22","SP8019-01","ALS-01","SP1002-02",null,null,null,null,"AL10",null,"AL6-200","AL4-200"]
[9380,40,"3/4\" BSP","Flange",null,"SK33",3298,"1210-0001-P","SP2701-21","SP1002-02",3269,"SP1003-01","SP2701-21","SP2600-13",null,"SP2600-13",5857,3266,3991,"3374-200"]
[9400,20,"0  16 Hose","Flange",null,"SK211",10817,"673-0001-P","SP2701-04","SP1002-09","2907-0001","SP1002-09",null,null,null,null,9407,null,9406,9404]
[9430,10,"1/4\" BSP","Flange","Exhaust Cooling","SK221",1126,"4528-0001-P","SP2701-09","SP1002-01","ALS","SP1002-09",null,null,"SP2701-09",null,9436,null,"AL6-200",4784]
[9560,10,"3/8\" BSP","Flange",null,"SK23",1189,"4528-0001-P","SP2701-14","SP1002-01",2763,"SP1002-03",null,null,null,null,"Contact Manufacturer",2765,9566,9564]
[9700,80,"1\" Flanged","Flange",null,"SK238",890,"17937-0001-P","22645-0000","SP1003-01",3255,"SP1004-11","SP2700-48",null,null,"SP2600-06",9707,4156,3993,9704]
[9710,80,"1\" NPT","Foot","9710-200","SK229",890,"17937-0001-P","22617-0010","SP1003-09","934-0000","SP1004-09","SP2701-21","SP2600-38","SP2700-47","SP2600-38",9717,4156,3993,10329]
[9730,80,"0  32 Hose","Flange",null,"SK269","890-01","17937-0001-P","22626-0000","SP1003-09",890,"SP1004-09","SP2700-07","SP2600-01",null,"SP2600-01",9737,4156,3993,9734]
[9750,80,"0 32 Hose","Flange",null,"SK269","3101-01","17937-0001-P","22626-0000","SP1003-09",3255,"SP1004-11","SP2700-07","SP2600-01",null,"SP2600-01",9757,4156,3993,9754]
[9760,80,"0  32 Hose","Flange",null,"SK269","890-01","17937-0001-P","22626-0000","SP1003-09","934-0000","SP1004-11","SP2700-07","SP2600-01","SP2700-07","SP2600-01",9767,4156,3993,9754]
[9900,20,"0  16 Hose","Foot","29470-\n2231C","SK211",10817,"673-0001-P","SP2701-04","SP1002-09",10818,"SP1002-02",null,null,null,null,9907,null,9905,9904]
[10490,270,"2\" Flanged","Foot","52270-\n0011","SK254",816,"21676-0001-P",21849,"SP1005-04",6988,"SP1005-04","SP2701-54","SP2601-37","SP2700-49","SP2601-37","11254-01",2574,9936,10494]
[10590,270,"2\" Flanged","Flange","10590-22","SK254",816,"21676-0001-P",21849,"SP1005-04",6988,"SP1005-04","SP2701-54","SP2601-37",null,"SP2601-41","11258-01",2574,9336,10494]
[10630,200,"1-1/2\"\nFlanged","Foot","52220-\n0011","SK230",816,"836-0001-P",21849,"SP1005-04",834,"SP1005-04","SP2701-54","SP2601-37","SP2700-49","SP2601-37",11254,2574,9336,10634]
[10650,200,"1-1/2\"\nFlanged","Foot","51220-\n0011","SK230",816,"836-0001-P",21849,"SP1005-04",834,"SP1005-04","SP2701-54","SP2601-37",null,"SP2601-37","10657-0020",2574,9336,10634]
{"$rows_left_out":898}
{"sheet":"Obsolete","index":3,"n_rows":479,"n_cols":4,"rows_kept":479,"cut":false,"hidden":false,"merged":[]}
["PART NUMBER TRANSLATION"]
["PUMP","OBSOLETE JABSCO PART NUMBER","CURRENT JABSCO PART NUMBER","DESCRIPTION"]
["52200-2011","9336","10773-0000","END COVER BRASS 200/270"]
["52200-2011","X3001-176F","X3003-176F-P","SCREW M6 X 10"]
[]
[]
[]
[]
["JABSCO OBSOLETE LIST",4850,9750,"Pump"]
["JABSCO OBSOLETE LIST",4860,9760,"Pump"]
["JABSCO OBSOLETE LIST",9710,"9710-200","Pump"]
["JABSCO OBSOLETE LIST",9900,"29470-2231C","Pump"]
["JABSCO OBSOLETE LIST",10420,"29490-2001C","Pump"]
["JABSCO OBSOLETE LIST",10490,"52270-0011","Pump"]
["JABSCO OBSOLETE LIST",10590,"10590-22","Pump"]
["JABSCO OBSOLETE LIST",10630,"52220-0011","Pump"]
["JABSCO OBSOLETE LIST",10650,"51220-0011","Pump"]
["JABSCO OBSOLETE LIST",10660,"51270-0011","Pump"]
["JABSCO OBSOLETE LIST",10670,"50220-0011","Pump"]
["JABSCO OBSOLETE LIST",10680,"50270-0011","Pump"]
["JABSCO OBSOLETE LIST",10880,"10880-07","Pump"]
["JABSCO OBSOLETE LIST",21890,"10880-2611","Pump"]
["JABSCO OBSOLETE LIST",22620,"29440-1101","Pump"]
["JABSCO OBSOLETE LIST",22770,"29440-1001","Pump"]
["JABSCO OBSOLETE LIST","10490-0201","50270-0911","Pump"]
["JABSCO OBSOLETE LIST","10490-07","52270-0011","Pump"]
["JABSCO OBSOLETE LIST","10490-207","52270-0011","Pump"]
["JABSCO OBSOLETE LIST","10590-01","11101-01-01","Pump"]
["JABSCO OBSOLETE LIST","10590-0141","10590-0041","Pump"]
["JABSCO OBSOLETE LIST","10590-21","10590-22","Pump"]
{"$rows_left_out":449}