{"text_format":"1","workbook":"xlsx","n_sheets":4,"sheets":["IDENTIFICATION","Price List","Service Parts","Obsolete"],"not_rendered":{"charts":0,"images":1,"macros":0,"external_links":0,"defined_names":4,"comments":0,"pivot_tables":0},"unopened":[],"bounds":{"document_bytes":16777216,"sheet_cells":100000,"rows_first":2000,"rows_last":500,"rows_between":2000,"halvings":0,"cell_chars":16384,"cell_head_chars":4096},"cells_cut":0,"cells_raw":0,"read":"whole","date_system":"1900"}

{"sheet":"IDENTIFICATION","index":0,"n_rows":25,"n_cols":22,"rows_kept":25,"cut":false,"hidden":false,"merged":[[1,5,1,6]]}
[null,"JABSCO PUMP PARTS AND PRICES",null,null,null,"LANCING MARINE ",null,null,"CALL LANCING MARNE TO ORDER 01273-410025",null,null,null,null,null,null,null,null,null,null,null,"ADMIN","ADMIN"]
[null,"MODEL NUMBER","DESCRIPTION","PRICE",null,{"$f":"HYPERLINK(\"mailto:DATA@LANCINGMARINE.COM\", \"Email: Data@Lancingmarine.com\")","v":"Email: Data@Lancingmarine.com"},null,null,"+44-1273-41005"]
[null,"52200-2011",{"$f":"IFERROR(INDEX('Price List'!B:B,MATCH(B3,'Price List'!A:A,0),1),\"NOT-FOUND\")","v":"EU PMP 1 1/2 BSP PED NEO 200"},{"$f":"IFERROR(INDEX('Price List'!E:E,MATCH(B3,'Price List'!A:A,0),1),\"NOT-FOUND\")","v":553.4}]
[null,"PORT TYPE","PUMP SIZE","MOUNT TYPE",null,"ALTERNATIVE MODEL","DESCRIPTION","WEIGHT","PRICEBOOK"]
[null,{"$f":"IFERROR(INDEX('Service Parts'!C:C,MATCH(B3,'Service Parts'!A:A,0),1),\"-\")","v":"1-1/2\" BSP"},{"$f":"IFERROR(INDEX('Service Parts'!B:B,MATCH(B3,'Service Parts'!A:A,0),1),\"-\")","v":200},{"$f":"IFERROR(INDEX('Service Parts'!D:D,MATCH(B3,'Service Parts'!A:A,0),1),\"-\")","v":"Foot"},null,{"$f":"IFERROR(INDEX(Obsolete!C:C,MATCH(B3,Obsolete!B:B,0),1),\"-\")","v":"-"},{"$f":"IFERROR(INDEX('Price List'!B:B,IF(U5=\"-\",V5,U5),1),\"-\")","v":"-"},{"$f":"IFERROR(INDEX('Price List'!D:D,U5,1),\"-\")","v":"-"},{"$f":"IFERROR(INDEX('Price List'!E:E,U5,1),\"-\")","v":"-"},null,null,null,null,null,null,null,null,null,null,null,{"$f":"IFERROR(MATCH(F5,'Price List'!A:A,0),\"-\")","v":"-"},"-"]
[]
[null,"COMPONENT","PART-NUM-VALUE","ALTERNATIVE-PART",null,"PART-NUM-VALUE","DESCRIPTION","WEIGHT","PRICEBOOK",null,"LINK","URL",null,null,null,null,null,null,null,null,"ROW","ALT-ROW"]
[null,"KIT NUMBER",{"$f":"IFERROR(INDEX('Service Parts'!F:F,MATCH(B3,'Service Parts'!A:A,0),1),\"-\")","v":"SK407-0011"},{"$f":"IFERROR(INDEX(Obsolete!C:C,MATCH(TRIM(C8),Obsolete!B:B,0),1),\"-\")","v":"-"},null,{"$f":"IFERROR(INDEX('Price List'!A:A,IF(U9=\"-\",V9,U9),1),\"NOT-FOUND\")","v":"SK407-0011"},{"$f":"IFERROR(INDEX('Price List'!B:B,IF(U9=\"-\",V9,U9),1),\"-\")","v":"KIT SERVICE 200 MP NEO"},{"$f":"IFERROR(INDEX('Price List'!D:D,IF(U9=\"-\",V9,U9),1),\"-\")","v":0.48699999999999999},{"$f":"IFERROR(INDEX('Price List'!E:E,IF(U9=\"-\",V9,U9),1),\"-\")","v":183.3},null,{"$f":"HYPERLINK(L8,\"LANCING MARINE\")","v":"LANCING MARINE"},"https://www.lancingmarine.com/",null,null,null,null,null,null,null,null,{"$f":"IFERROR(MATCH(C23,'Price List'!A:A,0),\"-\")","v":"-"},{"$f":"IFERROR(MATCH(D23,'Price List'!A:A,0),\"-\")","v":"-"}]
[null,"GASKET/ O-RING",{"$f":"IFERROR(INDEX('Service Parts'!G:G,MATCH(B3,'Service Parts'!A:A,0),1),\"-\")","v":816},{"$f":"IFERROR(INDEX(Obsolete!C:C,MATCH(TRIM(C9),Obsolete!B:B,0),1),\"-\")","v":"-"},null,{"$f":"IFERROR(INDEX('Price List'!A:A,IF(U10=\"-\",V10,U10),1),\"NOT-FOUND\")","v":"NOT-FOUND"},{"$f":"IFERROR(INDEX('Price List'!B:B,IF(U10=\"-\",V10,U10),1),\"-\")","v":"-"},{"$f":"IFERROR(INDEX('Price List'!D:D,IF(U10=\"-\",V10,U10),1),\"-\")","v":"-"},{"$f":"IFERROR(INDEX('Price List'!E:E,IF(U10=\"-\",V10,U10),1),\"-\")","v":"-"},null,{"$f":"HYPERLINK(L9,\"SEA WATER PUMPS\")","v":"SEA WATER PUMPS"},"https://www.lancingmarine.com/price-book/page-33/",null,null,null,null,null,null,null,null,{"$f":"IFERROR(MATCH(C8,'Price List'!A:A,0),\"-\")","v":58},{"$f":"IFERROR(MATCH(D8,'Price List'!A:A,0),\"-\")","v":"-"}]
[null,"IMPELLER",{"$f":"IFERROR(INDEX('Service Parts'!H:H,MATCH(B3,'Service Parts'!A:A,0),1),\"-\")","v":"17935-0001-P"},{"$f":"IFERROR(INDEX(Obsolete!C:C,MATCH(TRIM(C10),Obsolete!B:B,0),1),\"-\")","v":"-"},null,{"$f":"IFERROR(INDEX('Price List'!A:A,IF(U11=\"-\",V11,U11),1),\"NOT-FOUND\")","v":"17935-0001-P"},{"$f":"IFERROR(INDEX('Price List'!B:B,IF(U11=\"-\",V11,U11),1),\"-\")","v":"KIT IMPELLER POS"},{"$f":"IFERROR(INDEX('Price List'!D:D,IF(U11=\"-\",V11,U11),1),\"-\")","v":0.59},{"$f":"IFERROR(INDEX('Price List'!E:E,IF(U11=\"-\",V11,U11),1),\"-\")","v":46.7},null,{"$f":"HYPERLINK(L10,\"ABOUT JABSCO\")","v":"ABOUT JABSCO"},"https://www.lancingmarine.com/blog/jabsco-full-spare-patrs-lists.aspx",null,null,null,null,null,null,null,null,{"$f":"IFERROR(MATCH(C9,'Price List'!A:A,0),\"-\")","v":"-"},{"$f":"IFERROR(MATCH(D9,'Price List'!A:A,0),\"-\")","v":"-"}]
[null,"WATER SEAL",{"$f":"IFERROR(INDEX('Service Parts'!I:I,MATCH(B3,'Service Parts'!A:A,0),1),\"-\")","v":21849},{"$f":"IFERROR(INDEX(Obsolete!C:C,MATCH(TRIM(C11),Obsolete!B:B,0),1),\"-\")","v":"-"},null,{"$f":"IFERROR(INDEX('Price List'!A:A,IF(U12=\"-\",V12,U12),1),\"NOT-FOUND\")","v":21849},{"$f":"IFERROR(INDEX('Price List'!B:B,IF(U12=\"-\",V12,U12),1),\"-\")","v":"KIT MECHANICAL SEAL"},{"$f":"IFERROR(INDEX('Price List'!D:D,IF(U12=\"-\",V12,U12),1),\"-\")","v":0.05},{"$f":"IFERROR(INDEX('Price List'!E:E,IF(U12=\"-\",V12,U12),1),\"-\")","v":76.3},null,{"$f":"HYPERLINK(L11,\"FULL JABSCO PUMP LISTS\")","v":"FULL JABSCO PUMP LISTS"},"https://www.lancingmarine.com/price-book/page-84/",null,null,null,null,null,null,null,null,{"$f":"IFERROR(MATCH(C10,'Price List'!A:A,0),\"-\")","v":200},{"$f":"IFERROR(MATCH(D10,'Price List'!A:A,0),\"-\")","v":"-"}]
[null,"END COVER SCREWS",{"$f":"IFERROR(INDEX('Service Parts'!J:J,MATCH(B3,'Service Parts'!A:A,0),1),\"-\")","v":"X3001-176F"},{"$f":"IFERROR(INDEX(Obsolete!C:C,MATCH(TRIM(C12),Obsolete!B:B,0),1),\"-\")","v":"X3003-176F-P"},null,{"$f":"IFERROR(INDEX('Price List'!A:A,IF(U13=\"-\",V13,U13),1),\"NOT-FOUND\")","v":"X3003-176F-P"},{"$f":"IFERROR(INDEX('Price List'!B:B,IF(U13=\"-\",V13,U13),1),\"-\")","v":"SCREW M6 X 10"},{"$f":"IFERROR(INDEX('Price List'!D:D,IF(U13=\"-\",V13,U13),1),\"-\")","v":1E-3},{"$f":"IFERROR(INDEX('Price List'!E:E,IF(U13=\"-\",V13,U13),1),\"-\")","v":10.3},null,{"$f":"HYPERLINK(L12,\"JABSCO PUMP SERVICE REPAIR KITS\")","v":"JABSCO PUMP SERVICE REPAIR KITS"},"https://www.lancingmarine.com/price-book/page-85/",null,null,null,null,null,null,null,null,{"$f":"IFERROR(MATCH(C11,'Price List'!A:A,0),\"-\")","v":268},{"$f":"IFERROR(MATCH(D11,'Price List'!A:A,0),\"-\")","v":"-"}]
[null,"CAM",{"$f":"IFERROR(INDEX('Service Parts'!K:K,MATCH(B3,'Service Parts'!A:A,0),1),\"-\")","v":834},{"$f":"IFERROR(INDEX(Obsolete!C:C,MATCH(TRIM(C13),Obsolete!B:B,0),1),\"-\")","v":"834-0001"},null,{"$f":"IFERROR(INDEX('Price List'!A:A,IF(U14=\"-\",V14,U14),1),\"NOT-FOUND\")","v":"834-0001"},{"$f":"IFERROR(INDEX('Price List'!B:B,IF(U14=\"-\",V14,U14),1),\"-\")","v":"KIT CAM"},{"$f":"IFERROR(INDEX('Price List'!D:D,IF(U14=\"-\",V14,U14),1),\"-\")","v":0.39500000000000002},{"$f":"IFERROR(INDEX('Price List'!E:E,IF(U14=\"-\",V14,U14),1),\"-\")","v":36.700000000000003},null,{"$f":"HYPERLINK(L13,\"JABSCO COMPONENTS\")","v":"JABSCO COMPONENTS"},"https://www.lancingmarine.com/price-book/page-86/",null,null,null,null,null,null,null,null,{"$f":"IFERROR(MATCH(C12,'Price List'!A:A,0),\"-\")","v":"-"},{"$f":"IFERROR(MATCH(D12,'Price List'!A:A,0),\"-\")","v":112}]
[null,"CAM SCREW",{"$f":"IFERROR(INDEX('Service Parts'!L:L,MATCH(B3,'Service Parts'!A:A,0),1),\"-\")","v":"SP1005-04"},{"$f":"IFERROR(INDEX(Obsolete!C:C,MATCH(TRIM(C14),Obsolete!B:B,0),1),\"-\")","v":"-"},null,{"$f":"IFERROR(INDEX('Price List'!A:A,IF(U15=\"-\",V15,U15),1),\"NOT-FOUND\")","v":"NOT-FOUND"},{"$f":"IFERROR(INDEX('Price List'!B:B,IF(U15=\"-\",V15,U15),1),\"-\")","v":"-"},{"$f":"IFERROR(INDEX('Price List'!D:D,IF(U15=\"-\",V15,U15),1),\"-\")","v":"-"},{"$f":"IFERROR(INDEX('Price List'!E:E,IF(U15=\"-\",V15,U15),1),\"-\")","v":"-"},null,null,null,null,null,null,null,null,null,null,null,{"$f":"IFERROR(MATCH(C13,'Price List'!A:A,0),\"-\")","v":"-"},{"$f":"IFERROR(MATCH(D13,'Price List'!A:A,0),\"-\")","v":527}]
[null,"PUMP END OIL SEAL",{"$f":"IFERROR(INDEX('Service Parts'!M:M,MATCH(B3,'Service Parts'!A:A,0),1),\"-\")","v":"SP2700-50"},{"$f":"IFERROR(INDEX(Obsolete!C:C,MATCH(TRIM(C15),Obsolete!B:B,0),1),\"-\")","v":"-"},null,{"$f":"IFERROR(INDEX('Price List'!A:A,IF(U16=\"-\",V16,U16),1),\"NOT-FOUND\")","v":"NOT-FOUND"},{"$f":"IFERROR(INDEX('Price List'!B:B,IF(U16=\"-\",V16,U16),1),\"-\")","v":"-"},{"$f":"IFERROR(INDEX('Price List'!D:D,IF(U16=\"-\",V16,U16),1),\"-\")","v":"-"},{"$f":"IFERROR(INDEX('Price List'!E:E,IF(U16=\"-\",V16,U16),1),\"-\")","v":"-"},null,null,null,null,null,null,null,null,null,null,null,{"$f":"IFERROR(MATCH(C14,'Price List'!A:A,0),\"-\")","v":"-"},{"$f":"IFERROR(MATCH(D14,'Price List'!A:A,0),\"-\")","v":"-"}]
[null,"PUMP END BEARING",{"$f":"IFERROR(INDEX('Service Parts'!N:N,MATCH(B3,'Service Parts'!A:A,0),1),\"-\")","v":"SP2600-04"},{"$f":"IFERROR(INDEX(Obsolete!C:C,MATCH(TRIM(C16),Obsolete!B:B,0),1),\"-\")","v":"-"},null,{"$f":"IFERROR(INDEX('Price List'!A:A,IF(U17=\"-\",V17,U17),1),\"NOT-FOUND\")","v":"NOT-FOUND"},{"$f":"IFERROR(INDEX('Price List'!B:B,IF(U17=\"-\",V17,U17),1),\"-\")","v":"-"},{"$f":"IFERROR(INDEX('Price List'!D:D,IF(U17=\"-\",V17,U17),1),\"-\")","v":"-"},{"$f":"IFERROR(INDEX('Price List'!E:E,IF(U17=\"-\",V17,U17),1),\"-\")","v":"-"},null,null,null,null,null,null,null,null,null,null,null,{"$f":"IFERROR(MATCH(C15,'Price List'!A:A,0),\"-\")","v":"-"},{"$f":"IFERROR(MATCH(D15,'Price List'!A:A,0),\"-\")","v":"-"}]
[null,"DRIVE END OIL SEAL",{"$f":"IFERROR(INDEX('Service Parts'!O:O,MATCH(B3,'Service Parts'!A:A,0),1),\"-\")","v":"SP2701-1013"},{"$f":"IFERROR(INDEX(Obsolete!C:C,MATCH(TRIM(C17),Obsolete!B:B,0),1),\"-\")","v":"-"},null,{"$f":"IFERROR(INDEX('Price List'!A:A,IF(U18=\"-\",V18,U18),1),\"NOT-FOUND\")","v":"NOT-FOUND"},{"$f":"IFERROR(INDEX('Price List'!B:B,IF(U18=\"-\",V18,U18),1),\"-\")","v":"-"},{"$f":"IFERROR(INDEX('Price List'!D:D,IF(U18=\"-\",V18,U18),1),\"-\")","v":"-"},{"$f":"IFERROR(INDEX('Price List'!E:E,IF(U18=\"-\",V18,U18),1),\"-\")","v":"-"},null,null,null,null,null,null,null,null,null,null,null,{"$f":"IFERROR(MATCH(C16,'Price List'!A:A,0),\"-\")","v":"-"},{"$f":"IFERROR(MATCH(D16,'Price List'!A:A,0),\"-\")","v":"-"}]
[null,"DRIVE END BEARING",{"$f":"IFERROR(INDEX('Service Parts'!P:P,MATCH(B3,'Service Parts'!A:A,0),1),\"-\")","v":0},{"$f":"IFERROR(INDEX(Obsolete!C:C,MATCH(TRIM(C18),Obsolete!B:B,0),1),\"-\")","v":"-"},null,{"$f":"IFERROR(INDEX('Price List'!A:A,IF(U19=\"-\",V19,U19),1),\"NOT-FOUND\")","v":"NOT-FOUND"},{"$f":"IFERROR(INDEX('Price List'!B:B,IF(U19=\"-\",V19,U19),1),\"-\")","v":"-"},{"$f":"IFERROR(INDEX('Price List'!D:D,IF(U19=\"-\",V19,U19),1),\"-\")","v":"-"},{"$f":"IFERROR(INDEX('Price List'!E:E,IF(U19=\"-\",V19,U19),1),\"-\")","v":"-"},null,null,null,null,null,null,null,null,null,null,null,{"$f":"IFERROR(MATCH(C17,'Price List'!A:A,0),\"-\")","v":"-"},{"$f":"IFERROR(MATCH(D17,'Price List'!A:A,0),\"-\")","v":"-"}]
[null,"SHAFT",{"$f":"IFERROR(INDEX('Service Parts'!Q:Q,MATCH(B3,'Service Parts'!A:A,0),1),\"-\")","v":"52207-0000"},{"$f":"IFERROR(INDEX(Obsolete!C:C,MATCH(TRIM(C19),Obsolete!B:B,0),1),\"-\")","v":"-"},null,{"$f":"IFERROR(INDEX('Price List'!A:A,IF(U20=\"-\",V20,U20),1),\"NOT-FOUND\")","v":"52207-0000"},{"$f":"IFERROR(INDEX('Price List'!B:B,IF(U20=\"-\",V20,U20),1),\"-\")","v":"SHAFT 200"},{"$f":"IFERROR(INDEX('Price List'!D:D,IF(U20=\"-\",V20,U20),1),\"-\")","v":0.59299999999999997},{"$f":"IFERROR(INDEX('Price List'!E:E,IF(U20=\"-\",V20,U20),1),\"-\")","v":303.60000000000002},null,null,null,null,null,null,null,null,null,null,null,{"$f":"IFERROR(MATCH(C18,'Price List'!A:A,0),\"-\")","v":"-"},{"$f":"IFERROR(MATCH(D18,'Price List'!A:A,0),\"-\")","v":"-"}]
[null,"WEARPLATE",{"$f":"IFERROR(INDEX('Service Parts'!R:R,MATCH(B3,'Service Parts'!A:A,0),1),\"-\")","v":2574},{"$f":"IFERROR(INDEX(Obsolete!C:C,MATCH(TRIM(C20),Obsolete!B:B,0),1),\"-\")","v":"2574-0000"},null,{"$f":"IFERROR(INDEX('Price List'!A:A,IF(U21=\"-\",V21,U21),1),\"NOT-FOUND\")","v":"2574-0000"},{"$f":"IFERROR(INDEX('Price List'!B:B,IF(U21=\"-\",V21,U21),1),\"-\")","v":"KIT WEARPLATE"},{"$f":"IFERROR(INDEX('Price List'!D:D,IF(U21=\"-\",V21,U21),1),\"-\")","v":0.28999999999999998},{"$f":"IFERROR(INDEX('Price List'!E:E,IF(U21=\"-\",V21,U21),1),\"-\")","v":23.5},null,null,null,null,null,null,null,null,null,null,null,{"$f":"IFERROR(MATCH(C19,'Price List'!A:A,0),\"-\")","v":471},{"$f":"IFERROR(MATCH(D19,'Price List'!A:A,0),\"-\")","v":"-"}]
[null,"END COVER",{"$f":"IFERROR(INDEX('Service Parts'!S:S,MATCH(B3,'Service Parts'!A:A,0),1),\"-\")","v":9336},{"$f":"IFERROR(INDEX(Obsolete!C:C,MATCH(TRIM(C21),Obsolete!B:B,0),1),\"-\")","v":"10773-0000"},null,{"$f":"IFERROR(INDEX('Price List'!A:A,IF(U22=\"-\",V22,U22),1),\"NOT-FOUND\")","v":"10773-0000"},{"$f":"IFERROR(INDEX('Price List'!B:B,IF(U22=\"-\",V22,U22),1),\"-\")","v":"END COVER BRASS 200/270"},{"$f":"IFERROR(INDEX('Price List'!D:D,IF(U22=\"-\",V22,U22),1),\"-\")","v":1E-3},{"$f":"IFERROR(INDEX('Price List'!E:E,IF(U22=\"-\",V22,U22),1),\"-\")","v":127.6},null,null,null,null,null,null,null,null,null,null,null,{"$f":"IFERROR(MATCH(C20,'Price List'!A:A,0),\"-\")","v":"-"},{"$f":"IFERROR(MATCH(D20,'Price List'!A:A,0),\"-\")","v":318}]
[null,"BODY",{"$f":"IFERROR(INDEX('Service Parts'!T:T,MATCH(B3,'Service Parts'!A:A,0),1),\"-\")","v":"50204-2100"},{"$f":"IFERROR(INDEX(Obsolete!C:C,MATCH(TRIM(C22),Obsolete!B:B,0),1),\"-\")","v":"-"},null,{"$f":"IFERROR(INDEX('Price List'!A:A,IF(U23=\"-\",V23,U23),1),\"NOT-FOUND\")","v":"NOT-FOUND"},{"$f":"IFERROR(INDEX('Price List'!B:B,IF(U23=\"-\",V23,U23),1),\"-\")","v":"-"},{"$f":"IFERROR(INDEX('Price List'!D:D,IF(U23=\"-\",V23,U23),1),\"-\")","v":"-"},{"$f":"IFERROR(INDEX('Price List'!E:E,IF(U23=\"-\",V23,U23),1),\"-\")","v":"-"},null,null,null,null,null,null,null,null,null,null,null,{"$f":"IFERROR(MATCH(C21,'Price List'!A:A,0),\"-\")","v":"-"},{"$f":"IFERROR(MATCH(D21,'Price List'!A:A,0),\"-\")","v":140}]
[null,"ALTERNATE PUMP NUMBER",{"$f":"IFERROR(INDEX('Service Parts'!E:E,MATCH(B3,'Service Parts'!A:A,0),1),\"-\")","v":0},{"$f":"IFERROR(INDEX(Obsolete!C:C,MATCH(TRIM(C23),Obsolete!B:B,0),1),\"-\")","v":"-"},null,{"$f":"IFERROR(INDEX('Price List'!A:A,IF(U8=\"-\",V8,U8),1),\"NOT-FOUND\")","v":"NOT-FOUND"},{"$f":"IFERROR(INDEX('Price List'!B:B,IF(U8=\"-\",V8,U8),1),\"-\")","v":"-"},{"$f":"IFERROR(INDEX('Price List'!D:D,IF(U8=\"-\",V8,U8),1),\"-\")","v":"-"},{"$f":"IFERROR(INDEX('Price List'!E:E,IF(U8=\"-\",V8,U8),1),\"-\")","v":"-"},null,null,null,null,null,null,null,null,null,null,null,{"$f":"IFERROR(MATCH(C22,'Price List'!A:A,0),\"-\")","v":"-"},{"$f":"IFERROR(MATCH(D22,'Price List'!A:A,0),\"-\")","v":"-"}]
[null,null,null,null,null,"LANCING MARINE ",null,null,"CALL LANCING MARNE TO ORDER 01273-410025"]
[null,null,null,null,null,"DATA@LANCINGMARINE.COM",null,null,"+44-1273-41005"]

{"sheet":"Price List","index":1,"n_rows":1230,"n_cols":7,"rows_kept":1230,"cut":false,"hidden":false,"merged":[]}
["LANCING MARINE JABSCO PUMPS AND PARTS PRICES",null,null,null,null,null,"V.A.T. extra on U.K. sales, except Channel Isles."]
["PART-NUM-VALUE","Description","Pack Qty","Weight","PRICE",null,"Packing & Carriage is extra, optimum time route & cost tailored to the clients needs."]
["CW403","PUMP KIT 3/4  WITH 127MM PULLEY",1,2.44,360.8]
["CW404","PUMP KIT 3/4  WITH 159MM PULLEY",1,2.88,374]
["CW532","12V MACERATOR WITH AMP CONNECTOR",1,2.5,316.8]
["K1-200","KIT PORT 38MM (1.5  ) BSP",1,0.84,174.6]
["K2-200","KIT PORT 50MM (2  ) BSP",1,0.95,198]
["SK211","KIT SERVICE 020 SP NEO",1,6.7000000000000004E-2,48.4]
["SK220","KIT SERVICE 080 SP NEO",1,0.219,82.1]
["SK221","KIT SERVICE 010 SP NEO",1,4.8000000000000001E-2,61.6]
["SK224","KIT SERVICE (WATER PUPPY)",1,0.05,41.1]
["SK224-01","KIT SERVICE (MAXI PUPPY)",1,5.0999999999999997E-2,45.5]
["SK225-01","KIT SERVICE 040 SP NEO",1,0.127,71.900000000000006]
["SK228","KIT SERVICE 020 SP NEO",1,7.0999999999999994E-2,55.7]
["SK229","KIT SERVICE 080 SP NEO",1,0.246,136.4]
["SK229-37","KIT SERVICE 080 SP NIO",1,0.246,143.69999999999999]
["SK23","KIT SERVICE 010 SP NEO",1,4.4999999999999998E-2,57.2]
["SK23-0101","KIT SERVICE 010 SP NEO",1,4.2000000000000003E-2,48.4]
["SK230","KIT SERVICE 200 SP NEO",1,0.48699999999999999,176]
["SK230-37","KIT SERVICE 200 SP NIO",1,0.438,189.2]
["SK234","KIT SERVICE 040 SP NEO",1,0.14000000000000001,79.2]
["SK236","KIT SERVICE 080 SP NEO",1,0.20799999999999999,80.7]
["SK236-37","KIT SERVICE 080 SP NIO",1,0.19400000000000001,80.7]
["SK238","KIT SERVICE 080 SP NEO",1,0.24099999999999999,146.69999999999999]
["SK239","KIT SERVICE 040 SP NEO",1,0.161,130.5]
["SK254","KIT SERVICE 270 MP NE0",1,1.04,262.60000000000002]
["SK268","KIT SERVICE 040 SP NEO",1,0.27200000000000002,151.1]
["SK268-01","KIT SERVICE 040 SP NEO",1,0.27200000000000002,156.9]
["SK269","KIT SERVICE 080 SP NEO",1,0.248,255.2]
["SK271","KIT SERVICE 040 SP NEO",1,0.29799999999999999,121.8]
["SK33","KIT SERVICE 040 SP NEO",1,0.11600000000000001,70.400000000000006]
["SK351","KIT SERVICE 040 SP NEO",1,0.14499999999999999,133.5]
["SK352","KIT SERVICE 080 SP NEO",1,0.22,93.9]
["SK352-01","KIT SERVICE 080 SP NIO",1,0.22,92.4]
["SK368-0003","KIT SERVICE 020 TP NIO",1,0.14000000000000001,95.4]
["SK371-0000","KIT SERVICE",1,0.67400000000000004,164.3]
["SK374-0003","KIT SERVICE 005 PUPPIES",1,2.3E-2,45.5]
["SK374-0021","KIT SERVICE",1,0.1,86.6]
["SK384-0001","KIT SERVICE 040 SP NEO",1,0.11600000000000001,70.400000000000006]
["SK384-0101","KIT SERVICE 040 SP NEO",1,0.11600000000000001,68.900000000000006]
["SK384-0201","KIT SERVICE 040 NEO MECH",1,0.2,68.900000000000006]
["SK385-0001","KIT SERVICE 080 SP NEO",1,0.21199999999999999,79.2]
["SK385-0101","KIT SERVICE 080 SP NEO",1,0.23,73.400000000000006]
["SK385-0501","KIT SERVICE 080 SP NEO",1,0.2,79.2]
["SK385-0601","KIT SERVICE 080 SP NEO",1,0.21,73.400000000000006]
["SK385-0701","KIT - SERVICE 080 SP NEO",1,0.21,95.4]
["SK386-0001","KIT SERVICE 120 SP NEO",1,0.34,139.30000000000001]
["SK387-0001","KIT SERVICE 020 SP NEO",1,0.06,63.1]
["SK400-0023","KIT SERVICE 010 PUPPIES",1,7.5999999999999998E-2,57.2]
["SK401-0001","KIT SERVICE 020 SP NEO",1,6.5000000000000002E-2,60.1]
["SK402-0001","KIT SERVICE 020 MP NEO",1,0.85,130.5]
["SK404-0001","KIT SERVICE 010 SP NEO",1,3.5999999999999997E-2,45.5]
["SK405-0001","KIT SERVICE 020 SP NEO",1,6.3E-2,58.7]
["SK405-0101","KIT SERVICE 020 SP NEO",1,6.3E-2,60.1]
["SK406-0001","KIT SERVICE 080 NEO",1,0.246,83.6]
["SK406-0003","KIT SERVICE 080 SP NIO",1,0.246,83.6]
["SK407-0003","KIT SERVICE 200 SP NIO",1,0.48699999999999999,192.2]
["SK407-0011","KIT SERVICE 200 MP NEO",1,0.48699999999999999,183.3]
["SK408-0011","KIT SERVICE 270 MP NEO",1,0.69,275.8]
["SK408-0013","KIT SERVICE 270 MP NIO",1,0.57499999999999996,289]
["SK410","KIT SERVICE 470 MP NEO",1,0.98499999999999999,343.2]
["SK415-0113","KIT SERVICE (UTILITY 3000)",1,0.1,60.1]
["SK417-0001","KIT SERVICE",1,0.22,143.69999999999999]
["SK501-0000","KIT END COVER (51520)",1,0.1,48.4]
["SK503-0000","KIT SERVICE (020 MECH)",1,0.66500000000000004,67.5]
["SK504-0000","KIT SEAL/GASKET (020 MECH)",1,1E-3,55.7]
["SK505-0000","KIT END COVER (51510)",1,0.06,42.5]
["SP1003-0111","SCREW M5x8",1,2E-3,4.4000000000000004]
["SP1004-09-10","Kit, Screw MOQ 10",10,3.3000000000000002E-2,5.9]
["SP1602-13","(*line side) WASHER",1,1E-3,4.4000000000000004]
["SP1700-249","RETAINING RING EXT DIA 15.1",1,1E-3,4.4000000000000004]
["SP1700-284","RETAINING RING INT DIA 40",1,3.0000000000000001E-3,4.4000000000000004]
["SP1700-62-10","Kit, Retaining Ring MOQ 10",10,3.3000000000000002E-2,8.8000000000000007]
["SP1700-98","RETAINING RING EXT DIA 25",1,2E-3,5.9]
["SP1701-185","RETAINING RING INT DIA 47",1,5.0000000000000001E-3,7.3]
["SP1701-244","(*line side) RETAINING RING INT DIA 61.9",1,1.2E-2,5.9]
["SP1701-438","RETAINING RING INT DIA 47",1,2E-3,4.4000000000000004]
["SP1701-4437","RETAINING RING",1,1E-3,4.4000000000000004]
["SP1701-4438","RETAINING RING INT DIA 28",1,2E-3,4.4000000000000004]
["SP1701-4440","RETAINING RING EXT DIA 12",1,1E-3,4.4000000000000004]
["SP2000-21B","KIT, O-RING",1,0.03,7.3]
["SP2300-0061RA","ROTOR ARM ASSY 2A",1,3.0920000000000001,180.4]
["SP2300-0063FCUS","FIELD COIL 12V",1,1.0449999999999999,164.3]
["SP2300-0063RA","ROTOR ARM ASSY 1B",1,2.8,180.4]
["SP2300-0064FCUS","FIELD COIL 24V",1,1.0449999999999999,164.3]
["SP2600-01","BEARING (6203/QE6)",1,6.5000000000000002E-2,7.3]
["SP2600-12","BEARING (6203-2RS1/C3VM045)",1,6.4000000000000001E-2,10.3]
["SP2600-38","BEARING (RMS 5)",1,0.11899999999999999,57.2]
["SP2601-0451B","KIT, BEARING",1,4.7E-2,11.7]
["SP2601-0457","BEARING (6001-2RS1/VM045)",1,2.1000000000000001E-2,10.3]
["SP2601-0458","BEARING (6206-2RS1)",1,0.19800000000000001,19.100000000000001]
["SP2601-0468","BEARING (6204-2RS1/VM045)",1,0.109,13.2]
["SP2601-39B","KIT, BEARING",1,0.05,10.3]
["SP2601-41","BEARING (6206-RS1)",1,0.20300000000000001,19.100000000000001]
["SP2700-1027B","KIT, SEAL LIP",1,8.0000000000000002E-3,8.8000000000000007]
["SP2701-01B","KIT, SEAL LIP",1,7.0000000000000007E-2,17.600000000000001]
["SP2701-09","SEAL LIP (3/8, 0.875, 1/4)",1,4.0000000000000001E-3,11.7]
["SP2701-0903","SEAL-LIP GEAR COVER B",1,0.01,4.3]
["SP2701-1006B","KIT, SEAL LIP",1,0.05,7.3]
["SP2701-1013B","KIT, SEAL LIP",1,0.01,7.3]
["SP2701-1015B","KIT, SEAL LIP",1,0.01,8.8000000000000007]
["SP2701-15","SEAL",1,7.0000000000000001E-3,5.9]
["SP2701-21B","KIT, SEAL LIP",1,7.0000000000000007E-2,8.8000000000000007]
["SP2701-52B","KIT, SEAL LIP",1,0.1,7.3]
["SP3100-10","PIN",1,2E-3,4.4000000000000004]
["SP6080-06B","SEAL",1,3.1E-2,17.600000000000001]
["SP6080-08B","SEAL",1,0.03,58.7]
["SP8019-01","SCREW 8x32x1/4",1,5.0000000000000001E-3,5.9]
["V-SP2700-42","SPARE, SEAL",1,0.01,26.4]
["X3001-180F","SCREW-ST.ST.M6 X 16",1,5.0000000000000001E-3,4.3]
["X3002-147F","SCREW M5x8 SLOT PAN HD SS",1,2E-3,4.4000000000000004]
["X3003-176F-P","SCREW M6 X 10",1,1E-3,10.3]
["X3004-095G","SCREW M4-8 CH HD BRASS",1,0.01,4.4000000000000004]
["X3004-174F","SCREW CHEESE HD M6 X 8 LONG",1,1E-3,4.4000000000000004]
["X4000-567A","(*line side)KEY 8x7x40 ST",1,1.7000000000000001E-2,5.9]
["X4020-105A","(*line side)O-RING 1.6  X  5.1 (NIT)",1,1E-3,4.4000000000000004]
["X4020-106A","(*line side) O-RING 1.6  X 6.1   NIT",1,1E-3,4.4000000000000004]
["X4020-210A","O-RING 2.4  X 10.6 (NIT)",1,1E-3,4.4000000000000004]
["X4020-215A","(*line side) O-RING 2.4  X 15.6 (NIT)",1,4.0000000000000001E-3,4.4000000000000004]
["X4020-257A","(*line side)O-RING 2.4  X 57.6 (NIT)",1,1E-3,4.3]
["X4020-269A-50","Kit, O ring MOQ 50",50,2E-3,4.4000000000000004]
["X4020-269B","O-RING 2.4  X 69.6 (VIT)",1,2E-3,12.9]
["X4020-354A","O-RING 3 X 54.5 (NIT)",1,2E-3,4.3]
["X4020-394A","O-RING 3 X 94.5 (NIT)",1,3.0000000000000001E-3,7.2]
["X5251-052","O-RING 2.50 X 89 NIT",1,2E-3,4.4000000000000004]
["Y5026-08","(*line side)CIRCLIP",1,8.0000000000000002E-3,5.9]
[10374,"SHAFT 040",1,0.20799999999999999,227.4]
["1039-0000","KIT LIP SEAL",1,2.4E-2,41.1]
["10396-0010","KIT WEARPLATE",1,0.19,379.9]
["1040-0000","SEAL KIT",1,5.0000000000000001E-3,16.100000000000001]
["1040-0001","KIT SEAL VITON",1,1E-3,20.5]
["1041-0000","KIT SEAL",1,5.0000000000000001E-3,66]
["10550-200","EU PMP 3/4 BSP PED NEO 040",1,2.33,451.8]
["10550-205","EU PMP 3/4 BSP PED NEO 040",1,2.33,451.8]
["10590-0111","PUMP BRZ FLG 270 FLG",1,5.56,1478.5]
["10590-0451","PUMP BRZ FLG 270 FLG",1,8.4499999999999993,1353.8]
["10594-0030","HOUSING BRG",1,1.8440000000000001,316.8]
["10770-0021","PUMP BRZ FLG 200 FLG HP",1,7.17,831.7]
["10770-57","PUMP BRZ FLG 200 FLG",1,7.17,642.5]
["10773-0000","END COVER BRASS 200/270",1,1E-3,127.6]
[10818,"CAM BRASS 020",1,2.4E-2,38.1]
["10880-2561","PUMP BRZ FLG 200 BSP",1,7,1782.5]
["10950-2401","PUMP BRZ FLG 040 BSP",1,3.04,407.8]
[10970,"PUMP BRZ FLG 040 NPTF",1,3.26,638.79999999999995]
["10970-21","PUMP BRZ FLG 040 BSP",1,3.54,739.3]
["11100-0541","PUMP BRZ FLG 270 FLG",1,8.41,1126.5]
["11100-0601","PUMP BRZ FLG 270 FLG",1,9,1126.5]
[11258,"SHAFT ASSY",1,0.86,353.5]
["11258-01","SHAFT ASSY",1,0.95499999999999996,432.7]
["1126-0000","KIT GASKET",1,1E-3,13.2]
["11790-0101"," PUMP BRZ FLG",1,7.48,1071.4000000000001]
["11790-0201","PUMP BRZ FLG 200 FLG HP",1,7.48,1067.8]
["11796-0010","SHAFT ASSY",1,0.88,352]
["11830-0000","KIT ENDCOVER BRASS",1,0.187,19.100000000000001]
["11831-0000","KIT ENDCOVER",1,0.35,24.9]
["11835-0000","KIT ENDCOVER (17820-SERIES)",1,0.04,14.7]
["11877-0000","KIT SHAFT",1,0.65200000000000002,256.7]
["1189-0000","KIT GASKET",1,2E-3,7.3]
["11979-0001B","IMPELLER 080 SP NE",1,0.14399999999999999,63.1]
["12062-0000","END COVER",1,0.35,58.7]
["12071-0000","KIT ENDCOVER",1,0.21,30.8]
["1210-0001-P","KIT IMPELLER POS",1,0.13,33.299999999999997]
["1210-0001B","IMPELLER 040 SP NE SPL",1,8.6999999999999994E-2,36.700000000000003]
["1210-0003-P","KIT IMPELLER POS",1,0.6,36.700000000000003]
["1210-0003B","IMPELLER 040 SP NIO SPL",1,7.8E-2,36.700000000000003]
["12104-0001B","IMPELLER 005 SP NE PIN",1,8.9999999999999993E-3,63.1]
["12316-1002","WEARPLATE,BODY (MACERATOR)",1,5.0000000000000001E-3,14.7]
["12608-0000","GASKET (12600)",1,1E-3,17.600000000000001]
["13554-0001-P","KIT IMPELLER POS",1,0.16,63.1]
["14052-0000","KIT SEAL",1,0.105,133.5]
["1414-0001-P","KIT IMPELLER POS",1,0.04,29.3]
["1414-0001B","IMPELLER 005 SP NE 1FL",1,1.0999999999999999E-2,29.3]
["1414-0003-P","KIT IMPELLER POS",1,0.1,36.700000000000003]
["1414-0003B","IMPELLER 005 SP NIO 1FL",1,1.0999999999999999E-2,29.3]
["14609-0001B","IMPELLER 005 HP NE 1FL",1,1.0999999999999999E-2,74.8]
["14750-0003-P","KIT IMPELLER POS",1,8.9999999999999993E-3,41.1]
["15278-1000","KIT FLAPPER SUBASSY",1,0.2,286]
["15294-1020","15780 VORTEX WEARING RING",1,1,438.6]
["15296-1000","KIT PLATE",1,1.33,680.6]
["15297-1010","KIT CAM RING",1,1.57,542.70000000000005]
["15298-1020","15780 VORTEX BRONZE IMPELLER SERVICE KIT",1,3.5,1610.5]
["15780-0000","VORTEX COOLING PUMP",1,54.2,7623.3]
["17018-0001-P","KIT IMPELLER POS",1,0.28999999999999998,60]
["17018-0001B","IMPELLER 120 SP NE SPL",1,0.27600000000000002,66]
["17018-1101B","KIT IMPELLER 120 (IT)",1,0.26,66]
["17215-0000","DRILL PUMP FOR OIL CHANGE",1,0.24,60]
["17240-0001B","IMPELLER 370 MP NE SPL",1,0.78900000000000003,262.60000000000002]
["17250-0003","DRILL PUMP",1,0.16200000000000001,53.3]
["17255-0003-P","KIT IMPELLER POS",1,0.06,44]
["17365-1000","KIT GASKET",1,1E-3,13.2]
["1737-207","SHAFT 6490-222/223",1,0.1,244.9]
["17370-0001-P","KIT IMPELLER POS",1,0.49,180.4]
["17370-0001B","IMPELLER 270 SP NEF 2FL",1,0.442,180.4]
["17372-1000","KIT WEARPLATE",1,0.06,88]
["17374-1000","KIT CAM LINER",1,0.33800000000000002,201]
["17532-0020","KIT BEARING HOUSING",1,2,510.4]
["17536-0000","KIT - SHAFT",1,1.05,268.39999999999998]
["17810-1300","PUMP BRZ",1,16.2,1155.8]
["17860-2012","OIL CHG, FLAT TANK,12V",1,6,284.5]
["17935-0001-P","KIT IMPELLER POS",1,0.59,46.7]
["17935-0001B","IMPELLER 200 SP NE SPL",1,0.56499999999999995,51.4]
["17936-0001-P","KIT IMPELLER POS",1,0.87,112]
["17936-0001B","IMPELLER 270 MP NE SPL",1,0.61499999999999999,112]
["17937-0001-P","KIT IMPELLER POS",1,0.21,34.700000000000003]
["17937-0003-P","KIT IMPELLER BOX",1,0.1,42.5]
["17937-0003B","IMPELLER 080 SP N10 SPL",1,0.17,42.5]
["17938-0001-P","KIT IMPELLER POS",1,0.1,189.2]
["17938-0001B","IMPELLER 300 SP NEO",1,0.7,189.2]
["17954-0001-P","KIT IMPELLER POS",1,0.25,58.7]
["17954-0001B","IMPELLER BOXED",1,0.18,58.7]
["17956-0001-P","KIT IMPELLER POS",1,0.1,120.3]
["17956-0003B","IMPELLER 080 SP NIO DNG",1,0.23,120.3]
["17969-0000","SPLINE SEAL",1,1.4999999999999999E-2,14.7]
["17970-0100","PUMP 2 1/2 FLANGE MOUNT",1,10.1,1861.4]
["18220-1127","BLST 9G 12 1\" Z0 WS RP01",1,3.3,294.7]
["18327-0001-P","KIT IMPELLER POS",1,0.19,57.2]
["18653-0001-P","KIT IMPELLER POS",1,8.9999999999999993E-3,39.6]
["18653-0001B","IMPELLER 020 SP NEO PIN",1,0.04,39.6]
["18670-0943","WATER PUPPY COMM. DUTY 24V EMC",1,2.5,291.89999999999998]
["18673-0001-P","KIT IMPELLER POS",1,0.1,51.4]
["18673-0003-P","KIT IMPELLER POS",1,0.05,51.4]
["18673-0003B","IMPELLER 020 NIT",1,0.04,51.4]
["18711-0000","KIT RETAINING RING 3/BAG",1,0.01,23.5]
["18712-0000","KIT RETAINING RING",1,0.03,14.7]
["18713-0000","KIT RETAINING RING 3/BAG",1,0.01,5.9]
["18714-0000","KIT RETAINING RING (3 PER B",1,1.4999999999999999E-2,20.5]
["18721-0000","KIT RETAINING RING",1,2E-3,7.3]
["18724-0000","KIT RETAINING RING 3/BAG",1,1.4999999999999999E-2,11.7]
["18752-0000","BEARING",1,0.2,19.100000000000001]
["18753-0007","BEARING 30530/70 PED (1)",1,0.78500000000000003,93.9]
["18753-0090","KIT CAM",1,0.08,46.9]
["18753-0342","SEAL (30890-0001)",1,0.34599999999999997,225.9]
["18753-0355","END COVER SS 30550",1,0.29799999999999999,132]
["18753-0493","KIT CLUTCH 12V",1,8.6,291.89999999999998]
["18753-0494","KIT CLUTCH 24V",1,9.0220000000000002,308]
["18753-0524","O-RING - VORTEX PUMP",1,1E-3,23.5]
["18753-0525","KIT SHAFT (18770)",1,1.1599999999999999,438.6]
["18753-0530","KIT O-RING",1,2E-3,16.100000000000001]
["18753-0531","KIT O RING",1,0.01,16.100000000000001]
["18753-0546","KIT O-RING",1,0.01,17.600000000000001]
["18753-0616","KIT LIP SEAL",1,5.6000000000000001E-2,107.1]
["18753-0619","KIT SQUARE KEY",1,0.02,52.8]
["18753-0620","KIT SQUARE KEY",1,0.05,16.100000000000001]
["18753-0630","KIT LIP SEAL",1,0.01,22]
["18753-0660","KIT O-RING",1,0.01,5.9]
["18770-0004","PUMP BRZ FLG FLG NEO",1,16,4319.6000000000004]
["18777-0001-P","KIT IMPELLER POS",1,0.17,46.9]
["18777-0001B","IMPELLER 060 SP NE SPL",1,1.4E-2,46.9]
["18784-2000","KIT ENDCOVER",1,0.85,525.1]
["18785-0000","KIT CAM LINER 370",1,0.6,236.2]
["18786-0001B","KIT IMPELLER BOXED",1,0.59499999999999997,171.6]
["18787-0000","KIT WEARPLATE",1,0.27200000000000002,287.5]
["18789-0001","KIT IMPELLER NEOPRENE",1,0.77500000000000002,170.1]
["18838-0001-P","KIT IMPELLER POS",1,0.16,49.9]
["18838-0001B","IMPELLER (SHERWOOOD)",1,0.13100000000000001,49.9]
["18940-0010","PUMP 1-1/4 ENGINECOOLING",1,3.17,1065.4000000000001]
["18948-0001-P","KIT IMPELLER POS",1,0.24,44]
["18948-0001B","IMPELLER (SHERWOOD)",1,0.183,44]
["18958-0001-P","KIT IMPELLER POS",1,0.45,126.1]
["1985-0000","KIT GASKET",1,1E-3,7.8]
["1985-0010","KIT GASKET",1,4.0000000000000001E-3,10.3]
["21140-2401","PUMP BRZ FLG 080 BSP",1,3.601,398.2]
["21239-0020","SHAFT 200",1,0.78700000000000003,360.8]
["21414-0001-P","KIT IMPELLER POS",1,0.1,50]
["21414-0001B","IMPELLER 005 SP NE 1FL",1,0.05,29.3]
[21770,"PUMP BRZ FLG 040 HOSE TAIL",1,1.5,441.5]
[21777,"SHAFT",1,0.154,105.6]
[21849,"KIT MECHANICAL SEAL",1,0.05,76.3]
[22039,"CAM BRASS 270 3/4",1,0.2,95.4]
["22040-0501","PUMP BRZ FLG 270 FLG",1,8.1999999999999993,1305.4000000000001]
["22040-0701S","PUMP BRZ FLG 270 (GENERAL SALE)",1,8.74,1761.6]
["22130-2721","MACERATOR,110V,BULK",1,10.7,1076.5999999999999]
["22220-241","PUMP BRZ FLG 060 BSP",1,2.6,767.1]
["22268B","KIT, CAM",1,0.2,89.5]
["22318-0100","FULL CAM (2630N)",1,0.08,41.1]
["22318-0100B","FULL CAM (2630N) KIT",1,0.08,41.1]
["2235-0000","KIT WEARPLATE",1,5.5E-2,13.2]
["22405-0001-P","KIT IMPELLER POS",1,2.5000000000000001E-2,29.3]
["22405-0001B","IMPELLER 010 SP NE",1,2.4E-2,29.3]
["22466-0100","RETAINING CLIP",1,8.0000000000000002E-3,5.9]
["22617-0010","SEAL",1,5.5E-2,82.1]
["22626-0000","SEAL ASSEMBLY",1,0.04,73.400000000000006]
["22645-0000","KIT SEAL",1,0.1,90.9]
["22646-0000B","KIT SEAL MECHANICAL",1,4.2000000000000003E-2,54.3]
["22799-0001-P","KIT IMPELLER POS",1,6.8000000000000005E-2,45.5]
["22799-0001B","IMPELLER 020 SP NE DNG",1,0.06,45.5]
["23095-0007-P","IMPELLER KIT POS",1,0.06,78.8]
["23341-0000","CAM BRASS 120 FULL",1,0.11899999999999999,66]
["23341-0001","CAM BRASS 120 FULL",1,0.1,66]
["23342-0000","CAM BRASS 120 1.1",1,0.17100000000000001,95.4]
["23430-1001","PUMP BRZ FLG 080 HOSE",1,2.1,599.9]
["23430-1301","PUMP BRZ FLG 080 HOSE",1,2.2000000000000002,567.20000000000005]
["23430-1601","PUMP BRZ FLG 080 HOSE",1,2.13,737.8]
["23431-0000","SPACER",1,1E-3,4.4000000000000004]
["23435-0000","SHAFT 080",1,2.8000000000000001E-2,93.9]
["23437-0000","SHAFT 080",1,0.182,165.8]
["23610-3003","PMP 12V 020 MAXI PUPPY BSP",1,3.8,406.3]
["23610-3103","MAXI PUPPY 3000 PUMP 24V",1,3.8,369.4]
["23620-4003","MINI PUPPY 12V DC",1,2.7,321.2]
["23620-4103","MINI PUPPY 24V DC",1,2.7,321.2]
["23670-4003","PMP 12V 010 JUNIOR PUPPY BSP",1,3.3,297.8]
["23670-4103","JUNIOR PUPPY 24V DC",1,3.3,297.8]
["23680-4003","WATER PUPPY COMMERCIAL DUTY 12V",1,3.2,188]
["23680-4103","WATER PUPPY COMMERCIAL DUTY 24V",1,3.2,188]
["23825-0000B","KIT, END COVER",1,0.1,24.9]
["23826-0000B","KIT, CAM",1,0.05,33.700000000000003]
["23920-2223","PUMP UTILITY PUPPY 3000 12V BSP",1,4.6100000000000003,488.5]
["23920-2323","PUMP UTILITY PUPPY 3000 24V BSP",1,4.6500000000000004,488.5]
["23920-2423","PUMP UTILITY PUPPY 2000 12V DC BSP",1,3.3,312.39999999999998]
["23920-2523","PUMP UTILITY PUPPY 2000 24V DC BSP",1,3.3,284]
["23920-9223","PUMP UTILITY PUPPY 3000 12V NPT",1,4.6100000000000003,444]
["23920-9323","PUMP UTILITY PUPPY 3000 24V NPT",1,4.6100000000000003,488.5]
["23920-9523","PUMP UTILITY PUPPY 2000 24V DC NPT",1,3.3,312.39999999999998]
["2431-0000","KIT CAM",1,0.13,142.9]
[2441,"CAM BRASS 020 1/2",1,1.4999999999999999E-2,129.1]
["2473-0000","KIT CLUTCH CONE",1,1.56,143.69999999999999]
["2551-0000","KIT CAM",1,0.27500000000000002,79.2]
["2574-0000","KIT WEARPLATE",1,0.28999999999999998,23.5]
[2575,"DOWEL PIN",1,1E-3,4.4000000000000004]
[2763,"CAM BRASS 010 FULL",1,1.4999999999999999E-2,63.1]
["2765B","KIT, WEARPLATE",1,0.15,27.9]
["2907-0001B","KIT, CAM",1,0.35,44]
["29300-2731C","PUMP BRZ FLG 010",1,2,328.6]
["29300-2801C","PUMP BRZ FLG 010 BSP",1,1.5,328.6]
["29305-0000B","END COVER BRASS 010 KIT",1,0.05,79.2]
["29350-1001","PUMP BRZ FLG 010",1,1.0009999999999999,363.8]
["29350-1101","PUMP BRZ FLG 010 HOSE",1,1.0049999999999999,369.6]
["29440-1001","PUMP BRZ CSM 020 HOSE",1,1.83,313]
["29441-0000B","SEAL",1,2.3E-2,108.6]
["29450-1201","PUMP BRZ FLG 020 HOSE",1,1.3049999999999999,526.6]
["29450-1231","PUMP BRZ FLG 020 HOSE",1,1.28,503.1]
["29460-10-1041","PUMP BRZ FLG 020",1,1.6,280.2]
["29460-10-1051","PUMP BRZ FLG 020",1,1.6,280.2]
["29460-1631","PUMP BRZ FLG 020",1,1,280.2]
["29460-1701","PUMP BRZ FLG 020",1,1.5,359.4]
["29467-0000","SHAFT 020",1,7.6999999999999999E-2,70.400000000000006]
["29467-0010","SHAFT 020",1,0.06,89.5]
["29470-2231C","PUMP BRZ FLG 020 BSP",1,0.69,293.3]
["29470-2431C","PUMP BRZ FLG 020 BSP",1,0.69,375.4]
["29470-2531C","PUMP BRZ FLG 020 BSP",1,0.76,292.5]
["29475-0000","END COVER BRASS 020",1,6.5000000000000002E-2,42.5]
["29476-0000B","KIT, GASKET",1,1E-3,7.3]
["29477-0020","SHAFT 020",1,0.05,90.9]
["29500-1001","PUMP BRZ FLG 040 HOSE",1,1.22,463.5]
["29500-1501","PUMP BRZ FLG 040 HOSE",1,1.25,463.5]
["29500-1901","PUMP BRZ 040 HOSE",1,1.25,463.5]
["29507-0020","SHAFT 040",1,0.183,98.3]
["29508-0000B","KIT, SHAFT",1,0.4,133.5]
["29535-0100B","END COVER 040 KIT",1,0.1,118.5]
["29547-0100","SHAFT 040 VOLVO",1,0.16500000000000001,133.5]
["29600-1001","PUMP BRZ FLG 080 HOSE",1,2.54,591.1]
["29600-1201","PUMP BRZ FLG 080 HOSE",1,2.54,597]
["29600-1801","PUMP BRZ 080 FLG HOSE",1,2.96,649.79999999999995]
["29607-0000","SHAFT 080",1,0.22500000000000001,252.3]
["29608-0100","SHAFT 080",1,0.21199999999999999,170.1]
["29637-0100B","SHAFT KIT (SS316)",1,8.9999999999999993E-3,214.2]
["29640-1101","PUMP BRZ FLG 080 HOSE",1,4,737.8]
["29640-1251","PUMP-BRZ FLG 080 hose JCB",1,3.4,737.8]
["29647-0100","SHAFT 080",1,0.26,171.6]
["29700-1301","PUMP BRZ FLG 120 HOSE",1,3.8,806]
["29700-1331","PUMP BRZ FLG 120 HOSE",1,3.6,877.2]
["29706-0000","(*line side)WASHER",1,6.0000000000000001E-3,26.4]
["29772-0000","CAM BRASS 200 3/4",1,0.15,68.900000000000006]
["29825-1000","END COVER BRASS 300",1,0.45,103.8]
["29860-2201","EU PMP 2 1/2 BSP PED NEO 470",1,14.13,1550.4]
["29862-0100","CAM BRZ 470 FULL",1,0.54500000000000004,162.80000000000001]
["29865-0000","END COVER",1,0.63700000000000001,74.8]
["29866-0000","WEARPLATE",1,0.20799999999999999,73.400000000000006]
["29880-0001","PUMP BRZ FLG 470",1,11.83,2882.2]
["29887-0000","SHAFT",1,1.2509999999999999,309.5]
["2995-0030","GASKET",1,1E-3,4.4000000000000004]
["2999-0001","IMPELLER 500",1,1.923,525.1]
["30192-0000","KIT CAM LINER",1,0.22500000000000001,696.4]
["3085-0001B","IMPELLER 040 HP NE SPL",1,0.1,68.900000000000006]
["3085-0003B","IMPELLER 040 HP NIO SPL",1,9.0999999999999998E-2,68.900000000000006]
["30914-1000","KIT ENDCOVER (30890-0001)",1,0.18,86.6]
["30915-1000","KIT WEARPLATE (30890-0001)",1,0.1,46.9]
["30919-0001","KIT IMPELLER NEOPRENE",1,0.56799999999999995,88]
["31130-0061","IMPELLER 100 SPL NEO",1,0.23899999999999999,146.69999999999999]
["31500-0061-W","KIT IMPELLER BOX",1,0.1,289]
["3166-0000","KIT SEAL SPACER",1,0.01,7.3]
["3180-0000","KIT SLINGER (3 PER BAG)",1,0.01,10.3]
["3181-0000","KIT SLINGER (3 PER BAG)",1,0.01,7.3]
["3255-0000","KIT CAM",1,0.08,83.1]
["3270-200","PUMP BRZ FLG 040 BSP",1,1.58,416.9]
[3277,"SHAFT 040",1,0.127,142.30000000000001]
["3277-0000","KIT SHAFT",1,0.125,143.69999999999999]
["3278-0000","KIT COUPLING SS",1,0.08,79.2]
["3286-0000","KIT SLINGER",1,0.01,14.7]
["3298-0000","KIT GASKET",1,1E-3,4.4000000000000004]
["3376-0000","KIT RING ADAPTOR",1,8.4000000000000005E-2,113]
["3791-0000","KIT PACKING",1,0.02,11.7]
["4156-0000","KIT WEARPLATE",1,7.4999999999999997E-2,11.7]
["43000-0802","IMPELLER LUBRICANT PACK",1,1.2E-2,4.4000000000000004]
["4345-0000","KIT SPLINE SEAL",1,0.01,14.7]
["4345-0001","(*line side)SPLINE SEAL",1,2E-3,4.4000000000000004]
[4346,"(*line side) SEAL SPLINE",1,6.0000000000000001E-3,4.4000000000000004]
["4346-0000","KIT SEAL SPLINE",1,1E-3,13.2]
["4346-0001","SPLINE SEAL",1,6.0000000000000001E-3,4.4000000000000004]
[436977,"NEMP40/4 110-1-60 UL 1/2\"NPT MARINE",1,2.6549999999999998,393.5]
["4528-0001-P","KIT IMPELLER POS",1,8.9999999999999993E-3,29.3]
["4528-0001B","IMPELLER 010 SP NE PIN",1,0.02,29.3]
["4528-0003-P","KIT IMPELLER POS",1,0.04,42.5]
["4528-0003B","IMPELLER 010 SP NIO PIN",1,2.1000000000000001E-2,43.4]
["4568-0001-P","KIT IMPELLER POS",1,0.15,45.5]
["4568-0001B","IMPELLER 040 SP NE KEY",1,9.2999999999999999E-2,45.5]
["4568-0003B","IMPELLER 040 SP NIO KEY",1,8.3000000000000004E-2,48.4]
["4598-0001-P","KIT IMPELLER POS",1,0.1,61.6]
["4598-0001B","IMPELLER 080 SP NE KEY",1,0.17899999999999999,61.6]
["4598-0003-P","KIT IMPELLER POS",1,0.1,66]
["4598-0003B","IMPELLER 080 SP NIO KEY",1,0.16500000000000001,66]
["4732-0000","VACUUM SWITCH (AC MPU)",1,0.66,66]
["490-0001","KIT CAM BRASS",1,0.12,33.700000000000003]
["4908B","KIT, GASKET",1,0.04,5.9]
["50070-0040","IMPELLER REM TOOL 40/80",1,0.46,92]
["50070-0080","IMPELLER REMOVAL TOOL",1,1,110]
["50070-0200","IMPELLER REM TOOL 200/500",1,0.52,108]
["50070-1000B","Fiit - Flex Imp Insert Tools",1,0,247.5]
["50080-2001","PUMP BRZ CLTCH 080 2A 12V",1,5,732]
["50080-2101","PUMP BRZ CLTCH 080 2A 24V",1,5,732]
["50080-2201","PUMP BRZ CLTCH 080 1B 12V",1,5,732]
["50080-2301","PUMP BRZ CLTCH 080 1B 24V",1,5,732]
["50200-2011","PUMP BRZ CLTCH 200 2A 12V",1,9.5,888.9]
["50200-2111","PUMP BRZ CLTCH 200 2A 24V",1,9.5,888.9]
["50200-2211","PUMP BRZ CLTCH 200 1B 12V",1,9.5,888.9]
["50200-2311","PUMP BRZ CLTCH 200 1B 24V",1,10,888.9]
["50207-0000","SHAFT 200",1,0.75800000000000001,377]
["50220-0011","PUMP BRZ CLTCH 200 2A 12V",1,12.45,1045.8]
["50220-0111","PUMP BRZ CLTCH 200 2A 24V",1,12.45,1045.8]
["50220-0211","PUMP BRZ CLTCH 200 1B 12V",1,12.45,1045.8]
["50220-0311","PUMP BRZ CLTCH 200 1B 24V",1,12.45,1045.8]
["50270-0011","PUMP BRZ CLTCH 270 2A 12V",1,13.65,1305.4000000000001]
["50270-0111","PUMP BRZ CLTCH 270 2A 24V",1,13.65,1305.4000000000001]
["50270-0311","PUMP BRZ CLTCH 270 1B 24V",1,13.65,1305.4000000000001]
["50270-2011","PUMP BRZ CLTCH 270 2A 12V",1,12.2,1305.4000000000001]
["50270-2111","PUMP BRZ CLTCH 270 2A 24V",1,12.2,1305.4000000000001]
["50270-2211","PUMP BRZ CLTCH 270 1B 12V",1,12.2,1305.4000000000001]
["50270-2311","PUMP BRZ CLTCH 270 1B 24V",1,12.2,1186.8]
["50310-1301","PUMP BRZ FLG 080",1,3,1070.7]
["50355-0000","END COVER",1,0.2,26.4]
["50392-0000","CAM 120 PUMP",1,0.155,51.4]
["50392-0100","CAM 120 PUMP",1,0.17,51.4]
["50395-0100","PULLEY 6 GROOVE SECTION PK",1,0.38,55.7]
["50410-1201","PUMP BRZ CSM 060 LIP FULL",1,2.2000000000000002,531]
["50410-1251","PUMP BRZ CSM 060 LIP HALF",1,2.34,591.1]
["50580-2001","PUMP BRZ CLT 2A/12V 080 BSP",1,7.6,732]
["50580-2101","PUMP BRZ CLT 2A/24V 080 BSP",1,7.72,732]
["50580-2201","PUMP BRZ CLT 1B/12V 080 BSP",1,4.8,732]
["50580-2301","PUMP BRZ CLT 1B/24V 080 BSP",1,7.52,732]
["51080-2001","PUMP BRZ CLTCH 080 MAN BSP",1,4,1092.8]
["51200-2011","PUMP BRZ CLTCH 200 MAN BSP",1,8,1408.1]
["51220-0011","PUMP BRZ CLTCH 200 MAN FLG",1,12,1408.1]
["51270-0011","PUMP BRZ CLTCH 270 MAN FLG",1,11,1565.1]
["51270-2011","PUMP BRZ CLTCH 270 MAN BSP",1,11,1422.8]
["51510-2001","EU PMP 3/8 BSP PED NEO 010",1,1,212.7]
["51520-2001","EU PMP 3/8 BSP PED NEO 020",1,1,259.60000000000002]
["51520-2021","EU PMP 3/8 BSP PED NEO 020",1,0.98,259.60000000000002]
["51520-2201","EU PMP 3/8 BSP PED NEO 020",1,1,259.60000000000002]
["51580-2001","PUMP BRZ CLT MAN 080 BSP",1,6.25,1147]
["52040-2001","EU PMP 3/4 BSP PED NEO 040",1,1.78,256.7]
["52040-2003","EU PMP 3/4 BSP PED NIT 040",1,1.78,256.7]
["52040-2021","EU PMP 3/4 BSP PED NEO 040",1,1.5,256.7]
["52080-2001","PUMP BRZ PED 080 BSP NEO",1,2.27,325.60000000000002]
["52080-2003","PUMP BRZ PED 080 BSP NIO",1,2.27,325.60000000000002]
["52080-2021","PUMP BRZ PED 080 BSP NEO",1,2.1,325.60000000000002]
["52087-0000","SHAFT 080",1,0.24,187.8]
["52200-2003","EU PMP 1 1/2 BSP PED NIT 200",1,5,594.1]
["52200-2011","EU PMP 1 1/2 BSP PED NEO 200",1,4.84,553.4]
["52200-2021","EU PMP 1 1/2 BSP PED NEO 200",1,4.84,770.1]
["52201-0200B","ADAPTOR CLUTCH (SPARES)",1,0.4,88]
["52207-0000","SHAFT 200",1,0.59299999999999997,303.60000000000002]
["52220-0011","EU PMP 1 1/2 FLG PED NEO 200",1,7.9,891.8]
["52220-0021","EU PMP 1 1/2 FLG PED NEO 200",1,7.9,1100.9000000000001]
["52238-0000","CAM 200 FULL",1,0.18,57.2]
["52239-0000","END COVER 200",1,0.1,64.5]
["52270-0011","PUMP BRZ PED 270 FLG NEO",1,9.2240000000000002,1145.5999999999999]
["52270-2011","PUMP BRZ PED 270 BSP NEO",1,9.1199999999999992,1007.7]
["52277-0000","SHAFT 270",1,1.101,407.8]
["52580-2001","EU PMP 1 BSP PED NEO 080",1,3.01,440]
["53023-0000","CAM BRASS 020 FULL",1,2.5999999999999999E-2,54.3]
["53023-0100","CAM BRASS 020 2/3",1,0.02,54.3]
["5915-0001-P","KIT IMPELLER POS",1,8.9999999999999993E-3,73.400000000000006]
["5915-0001B","IMPELLER 080 SP NE SPL",1,0.18,73.400000000000006]
["5929-0001-P","KIT IMPELLER POS (NEO)",1,0.1,93.9]
["5929-0003-P","KIT IMPELLER POS",1,0.14000000000000001,93.9]
["5929-0003B","IMPELLER 040 SP NIO DNG",1,0.111,93.9]
["6056-0003-P","KIT IMPELLER POS",1,0.23,113.3]
["6303-0001-P","KIT IMPELLER POS",1,8.9999999999999993E-3,32.299999999999997]
["6303-0001B","IMPELLER 020 TP NE IFL",1,0.03,32.299999999999997]
["6303-0003-P","KIT IMPELLER POS",1,0.06,29.3]
["6303-0003B","IMPELLER 020 TP NIO IFL",1,2.7E-2,32.299999999999997]
["6303-0007-P","KIT IMPELLER POS",1,0.06,52]
["6303-0033B","KIT IMPELLER 020",1,0.2,32.299999999999997]
["6342-0000","KIT SLINGER (3 PER BAG)",1,5.0000000000000001E-3,14.7]
["6400-0004","US PMP 1 1/4 NPT PED NEO 200",1,5.4,806.7]
["6400-0051","US PMP 1 1/4 NPT PED NEO 200",1,1.5,902.1]
["6400-1051","US PMP 1 1/4 NPT PED NEO 200",1,5,913.8]
["6407-0010","SEAL ASSEMBLY",1,0.05,64.5]
["6408-0000","KIT SEAL",1,9.5000000000000001E-2,67.5]
[6496,"GASKET",1,1E-3,5.9]
["653-0001-P","KIT IMPELLER POS",1,7.0000000000000007E-2,28.7]
["653-0001B","IMPELLER 020 SP NE PIN",1,6.3E-2,29.3]
["6590-0005","PUMP 1 1/4 UNIVERSAL CLUTCH",1,9,2407]
["6718-21","SHAFT 080",1,0.26400000000000001,292.2]
["673-0001-P","KIT IMPELLER POS",1,0.1,41.1]
["673-0001B","IMPELLER 020 SP NE PIN",1,6.3E-2,41.1]
["6760-0001B","IMPELLER 270 MP NE SPL",1,0.59699999999999998,184.8]
["6760-0003B","IMPELLER 270 MP NIOSPL",1,0.51200000000000001,184.8]
["6988-0000","KIT CAM",1,0.51500000000000001,57.2]
["706-0010","KIT GASKET",1,1E-3,8.8000000000000007]
["7273-0001-P","KIT IMPELLER POS",1,0.1,32.299999999999997]
["7273-0001B","IMPELLER 020 SP NE IFL",1,2.9000000000000001E-2,32.299999999999997]
["7273-0003-P","KIT IMPELLER POS",1,0.08,32.299999999999997]
["7273-0003B","IMPELLER 020 SP NIO IFL",1,2.8000000000000001E-2,32.299999999999997]
["7420-0004","US PMP 1 1/4 NPT PED NEO 200",1,5.4,1019.4]
["7420-0101","US PMP 1 1/4 NPT PED NEO 200",1,4.97,1019.4]
["777-0001","PUMP 1   FOOTMOUNT",1,1.2,641]
[7876,"CAM BRASS 040 FULL",1,5.5E-2,49.9]
["7876-0000","KIT CAM ASSY",1,0.03,41.1]
["7883-0000","KIT WEARPLATE",1,7.0000000000000007E-2,8.8000000000000007]
[7884,"BRASS CAM/WEARPLATE KIT",1,8.1000000000000003E-2,60.1]
["7884-0000","CAM/WEARPLATE KIT",1,0.09,45.5]
["816-0000","KIT GASKET",1,1E-3,5.9]
["817-0000","KIT BEARING SEAL",1,0.05,20.5]
["818-0000","KIT LIP SEAL",1,0.09,22]
["824-2001","SHAFT (6400/7420)",1,0.66,149.6]
["834-0001","KIT CAM",1,0.39500000000000002,36.700000000000003]
["836-0001-P","KIT IMPELLER POS",1,0.55000000000000004,55.7]
["836-0001B","IMPELLER 200 SP NE SPL",1,0.51,55.7]
["836-0003B","IMPELLER 200 SP NIO SPL",1,0.36,55.7]
["879-0000","KIT SLINGER (3 PER BAG)",1,0.01,24.9]
["890-0000","KIT GASKET",1,6.0000000000000001E-3,5.9]
["90061-0031","KIT MINOR SERVICE",1,9.5000000000000001E-2,38.1]
["90061-0053","KIT MINOR SERVICE",1,9.5000000000000001E-2,42.5]
["90071-0001","KIT SERVICE (18770)",1,1.4,498.7]
["90105-0003","KIT SERVICE (11810)",1,0.152,145.19999999999999]
["90135-0001","KIT MINOR SERVICE",1,0.57999999999999996,201]
["91002-0010","KIT FIL HD SLTD SCREW (3PCS)",1,0.1,7.3]
["91002-0020","KIT FIL HD SLTD SCREW (3PCS",1,5.0000000000000001E-3,7.3]
["91002-0090","KIT FIL HD SLTD SCREW (3PCS",1,5.0000000000000001E-3,7.3]
["91003-0010","KIT FIL HD SLTD SCREW (3PCS",1,5.0000000000000001E-3,7.3]
["91003-0090","KIT FIL HD SLTD SCREW (3PCS",1,6.0000000000000001E-3,7.3]
["91004-0090","KIT SCREW (3 OFF)",1,1E-3,8.8000000000000007]
["91004-0110","KIT FILLESTER HD SLOT SCREW",1,1.4999999999999999E-2,14.7]
["91005-0040","KIT FIL HD SLTD SCREW (3PCS",1,0.01,7.3]
["91005-0050","KIT SCREW",1,0.1,4.4000000000000004]
["91085-6341","NUT M20x1.5 FINE PITCH HEX",1,5.0999999999999997E-2,10.3]
["913-0000","KIT LIP SEAL",1,0.03,14.7]
["914-0000","KIT LIP SEAL",1,0.06,17.600000000000001]
["91401-0100","KIT WOODRUFF KEY",1,0.01,21.6]
["91402-0010","KIT WOODRUFF KEY",1,1.2E-2,23.5]
["91402-0230","KIT WOODRUFF KEY",1,2.1999999999999999E-2,10.3]
["91700-0620","KIT RETAINING RING",1,0.01,24.9]
["91700-6001","RING RETAINING",1,1E-3,5.9]
["91701-0260","KIT RETAINING RING",1,2.4E-2,14.7]
["920-0001-P","KIT IMPELLER POS",1,0.19,38.700000000000003]
["920-0001B","IMPELLER 080 SP NEO SPL",1,0.16500000000000001,42.5]
["920-0003-P","KIT IMPELLER POS",1,8.9999999999999993E-3,42.5]
["920-0003B","IMPELLER 080 SP NIO SPL",1,0.16500000000000001,42.5]
["920-0008B","IMPELLER 080 SP NAT SPL",1,0.155,68.900000000000006]
["9200-0011B","IMPELLER 010 MP NE 1FL",1,2.1999999999999999E-2,38.1]
["9200-0013B","IMPELLER 010 MP NIO IFL",1,1.4999999999999999E-2,34.700000000000003]
["9200-0021B","IMPELLER 010 MP NE IFL",1,4.2000000000000003E-2,38.1]
["9200-0023-P","KIT IMPELLER POS",1,0.08,34.700000000000003]
["9200-0023B","IMPELLER 010 MP NIO IFL",1,0.04,38.1]
["9200-0033B","IMPELLER 010 HP NIO IFL",1,1.4999999999999999E-2,38.1]
["92000-0120","KIT O-RING",1,8.0000000000000002E-3,5.9]
["92000-0210","KIT O-RING (3/BAG)",1,0.01,5.9]
["92000-0310","KIT O-RING",1,0.01,5.9]
["92000-1240","O-RING PARKER N2-145 NIT",1,3.0000000000000001E-3,5.9]
["9214-0001","KIT KEY",1,1E-3,10.3]
["92300-0061","KIT MAGNETIC CLUTCH",1,8.65,344.7]
["92600-0020","KIT BALL BEARING",1,0.31,22]
["92600-0040","BALL BEARING",1,0.67800000000000005,45.5]
["92600-0060","KIT BEARING",1,0.375,42.5]
["92600-0070","BALL BEARING",1,0.16,44]
["92600-0130","BALL BEARING",1,0.11799999999999999,16.100000000000001]
["92600-0260","BALL BEARING",1,0.47,63.1]
["92600-0330","KIT BALL BEARING",1,0.66,27.9]
["92600-0500","BALL BEARING",1,0.27,17.600000000000001]
["92601-0450","KIT, BEARING BALL",1,0.43,67.5]
["92601-0460","KIT, ROLLER BEARING",1,0.91,92.4]
["92700-0050","KIT LIP SEAL",1,3.5000000000000003E-2,16.100000000000001]
["92700-0060","SEAL",1,1.6E-2,24.9]
["92700-0110","SEAL LIP",1,4.0000000000000001E-3,19.100000000000001]
["92701-0040","KIT LIP SEAL",1,0.02,8.8000000000000007]
["92701-0110","KIT LIP SEAL",1,0.02,17.600000000000001]
["92701-0180","KIT SEAL (LIP)",1,1E-3,13.2]
["92701-0880","KIT SEAL LIP 42x85x8",1,5.3999999999999999E-2,19.100000000000001]
["93000-0100","SEAL (23610/80-3)",1,0.02,19.100000000000001]
["93100-0010","KIT ROLL PIN",1,5.0000000000000001E-3,13.2]
["9328-0200","END COVER (PUPPY)",1,0.1,19.100000000000001]
["934-0000","KIT CAM",1,0.22,26.4]
[9566,"END COVER BRASS 010",1,5.5E-2,14.7]
["96080-0080","SEAL MECHANICAL",1,0.03,61.6]
["96080-0371","KIT MECHANICAL SEAL",1,0.19,89.5]
["96080-0620","MECH SEAL 16x28.55x15.5",1,5.0000000000000001E-3,36.700000000000003]
["96080-0626B","SEAL KIT - HARD FACED",1,0.02,90.9]
["96080-6024","SEAL MECH 12-24.3-12",1,7.0000000000000001E-3,20.5]
["96080-6564","SEAL (2 PART SEAL&SEAT REQ)",1,5.0000000000000001E-3,11.7]
["9700-0001","PUMP BRZ FLG 080 FLG",1,2.8,670.3]
["9700-01","PUMP BRZ FLG 080 BSP",1,2.78,670.3]
["9700-04","PUMP BRZ FLG 080 BSP",1,2.76,702.6]
["9700-131","PUMP BRZ FLG 080 FLG",1,2.78,670.3]
["9700-21","PUMP BRZ FLG 080 BSP",1,2.77,670.3]
[9707,"SHAFT 080",1,0.26300000000000001,218.6]
["9710-200","EU PMP 1 BSP PED NEO 080",1,3.57,513.4]
["9710-2103","EU PMP 1 BSP PED NIT 080",1,3.6,561]
["99071-0001","KIT SERVICE",1,4.6399999999999997,1431.6]
["99202-1000","15780 VORTEX MAJOR SERVICE KIT",1,7.5,2977.6]
["9970-200","PUMP BRZ FLG 040 BSP",1,1.74,541.29999999999995]
["9970-241","PUMP BRZ FLG 040 BSP",1,1.76,553]
["9970-241-37","PUMP BRZ FLG 040 BSP",1,1.76,536.79999999999995]
["9977-01","SHAFT 040",1,0.191,115.9]
["9990-41","PUMP BRZ FLG 040 NPT",1,1.89,550]
["58080-1624","TOILET DF14V 24V W/S FR",1,26,881.6]
["CW530","10 x 1 LITRE LIQUID ODOURLOS",1,11.96,136.4]
["CW564","TOILET FRESH CLEANER 12 PACK",1,13.6,117.4]
["P501J-115S-3A","PARMAX HD5 12V 19LPM 40PSI",1,2.8610000000000002,238]
["P501J-118S-3A","PARMAX HD5 12V 19LPM 60PSI",1,2.8610000000000002,238]
["P501J-119N-3A","HOTSHOT HD5 12V 19LPM 70PSI",1,2.8690000000000002,263.8]
["P601J-215S-3A","PARMAX HD6 12V 23LPM 40PSI",1,3.25,283.10000000000002]
["P601J-218S-3A","PARMAX HD6 12V 23LPM 60PSI",1,3.25,283.10000000000002]
["P601J-219N-3A","HOTSHOT HD6 12V 23LPM 70PSI",1,3.2440000000000002,308.8]
["P601J-219N-4A","HOTSHOT HD6 12V 23LPM 70PSI KIT",1,4.327,366.7]
["P602J-215S-3A","PARMAX HD6 24V 23LPM 40PSI",1,3.2530000000000001,311.39999999999998]
["P602J-218S-3A","PARMAX HD6 24V 23LPM 60PSI",1,3.2530000000000001,283.10000000000002]
["P602J-219N-3A","HOTSHOT HD6 24V 23LPM 70PSI",1,3.4580000000000002,341]
["Q301J-115S-3A","PARMAX HD3 12V 11LPM 40PSI",1,2.3679999999999999,167.3]
["Q301J-118S-3A","PARMAX HD3 12V 11LPM 60PSI",1,2.3679999999999999,184]
["Q401J-112S-3A","PARMAX HD4 12V 15LPM 25PSI",1,2.714,212.3]
["Q401J-115S-3A","PARMAX HD4 12V 15LPM 40PSI",1,2.714,212.3]
["Q401J-118N-3A","HOTSHOT HD4 12V 15LPM 60PSI",1,3.0209999999999999,199.4]
["Q401J-118N-4A","HOTSHOT HD4 12V 15LPM 60PSI KIT",1,3.601,244.5]
["Q401J-118S-3A","PARMAX HD4 12V 15LPM 60PSI",1,2.714,212.3]
["Q402J-112S-3A","PARMAX HD4 24V 15LPM 25PSI",1,2.714,231.6]
["Q402J-115S-3A","PARMAX HD4 24V 15LPM 40PSI",1,2.714,231.6]
["Q402J-118N-3A","HOTSHOT HD4 24V 15LPM 60PSI",1,2.9489999999999998,240.6]
["Q402J-118S-3A","PARMAX HD4 24V 15LPM 60PSI",1,2.714,254.8]
["SK386-0301","MINOR SERVICE KIT - 120 SP NEO",1,0.21,132]
["SK880","SERVICE KIT (50880-SERIES)",1,0.13800000000000001,27.6]
["SK890","SERVICE KIT (50890-SERIES)",1,0.2,27.6]
["SP1613-0140","WASHER",1,1E-3,2]
[2090770,"KIT 426 PSW 70 PSI",1,0.13600000000000001,55.2]
["1232R","800/1100 GPH Strainer",1,0.05,19.100000000000001]
["12558-0000","GASKET (37010)",1,1E-3,3.1]
["16470-0025","KIT: PRESS SW 1.7BAR HD MODELS",1,0.14599999999999999,29.3]
["16470-0040","KIT: PRESS SW 2.4BAR HD MODELS",1,0.22600000000000001,29.3]
["16470-0060","KIT: PRESS SW 4.1BAR HD MODELS",1,0.14599999999999999,29.3]
["16470-0070","KIT: PRESS SW 4.8BAR HD MODELS",1,0.14599999999999999,29.3]
["17288-1000","BOLT KIT - MACERATOR",1,0.8,19.100000000000001]
["17800-2000","OIL CHG,PORTA QUICK,12V",1,5,374.7]
["17800-2024","OIL CHG,PORTA QUICK,24V",1,5.12,453.3]
["17820-0024","OIL CHG,PERMANENT,24V",1,5,655.7]
["17830-0012","OIL CHG,PERMANENT,12V",1,3,387.2]
["17830-0024","OIL CHG,PERMANENT,24V",1,3,421]
["18590-2092","MACERATOR,12V",1,2.2999999999999998,261.39999999999998]
["18590-2094","MACERATOR,24V",1,2.2999999999999998,262.7]
["18594-1000","KIT HOUSING LONG",1,0.43,46.1]
["18596-1000","KIT GASKET-MACERATOR",1,0.01,9.8000000000000007]
["18597-0000","WEAR PLATE (MACERATOR)    U",1,0.04,13.6]
["18597-1000","KIT WEARPLATE",1,0.1,12.5]
["18598-1000","SERVICE KIT (18590)",1,0.24,56.8]
["18753-0020","FILTER 20# MESH (46200-XXXX",1,0.01,10.3]
["18753-0040","FILTER 40# MESH (46400-XXXX",1,0.01,11.7]
["18753-0141","MICRO SWITCH (ALL WPS)",1,0.01,20.8]
["18753-0167","KIT GASKET",1,0.01,3.8]
["18753-0178","SEALED BEAM (60020 12/24V)",1,0.43,68.8]
["18753-0335","SECONDARY CONTROL KIT 24V",1,0.65,547.1]
["18753-0336","SEALED BEAM 12/24V (60010)",1,0.26,146.69999999999999]
["18753-0350","MOTOR KIT HORIZ (60010/20)",1,0.11,50.8]
["18753-0447","SEALED BEAM (61040)",1,0.87,234.7]
["18753-0455","SEALED BEAM 12/24V (60080)",1,0.9,93.9]
["18753-0457","DRIVE ARM/GEAR (60010/80)",1,0.06,40.799999999999997]
["18753-0458","MOTOR KIT VERT (60010/20)",1,0.18,70.7]
["18753-0528","KIT BEAM 155SL SEALED",1,0.04,68.8]
["18753-0554","MOTOR 12V EMC(QF&DS TOILET)",1,1.5,184]
["18753-0555","MOTOR 24V EMC(QF&DS TOILET)",1,1.8,173.1]
["18753-0637","BOWL MOUNTING KIT(ELECTRIC)",1,0.25,19.399999999999999]
["18753-0661","PORTS KIT (45490-1000)",1,0.17100000000000001,20.5]
["18753-0729","KIT: HD MODEL BASEPLATE W/FEET",1,0.23,11]
["18753-0730","KIT: DIAPH/DRIVE ASSY NG QUAD",1,0.59,52.4]
["18753-0731","KIT: CVA EPDM NG QUAD",1,0.23,15.8]
["18753-1002","EQUAL TEE 15mm KIT",1,0.06,27.9]
["18753-1003","EMERGENCY SHUT OFF TAP KIT",1,7.0000000000000007E-2,38.200000000000003]
["18753-5019","KIT P/S 80PSI E 1/4HB",1,3.5999999999999997E-2,52.4]
["18753-8000","KIT: DIAPH/DRIVE ASSY 5CH",1,0.31,52.4]
["18753-8001","KIT: CVA EPDM 5CH MODELS",1,8.8999999999999996E-2,15.8]
["1877K-1122S","2 x 9mm Straight Hosebarb, 3.8LPM",1,0.18,5.7]
["1877K-2222E","2 x 13mm Elbow Hosebarb, 5-19LPM",1,0.18,5.7]
["1877K-2222S","2 x 13mm Straight Hosebarb, 7-19LPM",1,0.18,5.7]
["1877K-2242E","2 x 1/2\" Elbow NPS, 5-19LPM",1,0.18,6.5]
["1877K-2242S","2 x 1/2\" Straight NPS, 5-19LPM",1,0.18,6.5]
["1877K-2342S","2 x 1/2\" Straight NPS, 22LPM",1,0.18,6.5]
["1877K-3211S","1 x 3/4\" Straight GHT, 5-19LPM",1,0.27,3.4]
["1877K-3222E","2 x 19mm Elbow Hosebarb, 5-19LPM",1,0.18,5.7]
["1877K-3222S","2 x 19mm Straight Hosebarb, 5-19LPM",1,0.18,5.7]
["1877K-3311S","1 x 3/4\" Straight GHT, 22LPM",1,1.4E-2,3.4]
["1877K-3322E","2 x 19mm STRAIGHT H BARB",1,0.18,5.7]
["1877K-3322S","2 x 19mm Straight Hosebarb, 22LPM",1,0.05,6.5]
["18910-4027","UP HOUSING & SENSOR (31750)",1,0.3,45.3]
["18910-4028","UP HOUSING & SENSOR (31755)",1,1.72,58]
["18911-1030","CHECK VALVE ASSY 31X95",1,3.9E-2,20.5]
["18911-7010","VALVE KIT 31610/31705",1,0.1,14.7]
["18912-3040","KIT DIAPHRAGM",1,6.0000000000000001E-3,16.100000000000001]
["18914-1025","P'HEAD ASSY 2.9 25PSI 31395",1,0.39500000000000002,76.400000000000006]
["18914-1040","P'HEAD ASSY 2.9 40PSI 31395",1,0.437,76.400000000000006]
["18915-9002","LOWER HOUSING ASSY",1,0.4,41]
["18916-0118","KIT P/S 40PSI E/N/V MRN",1,0.03,29.3]
["18916-1025","KIT: PRESS SW 1.7BAR PARMAX 2/3",1,5.2999999999999999E-2,29.3]
["18916-1035","KIT: PRESS SW 2.4BAR PARMAX 2/3",1,0.16,29.3]
["18916-1040","KIT P/S 40PSI E MRN",1,5.2999999999999999E-2,29.3]
["18916-1050","KIT P/S 50PSI E MRN",1,5.1999999999999998E-2,29.3]
["18916-1060","KIT P/S 60PSI E MRN",1,5.2999999999999999E-2,30.8]
["18920-9042","HYBRID PARMAX SERVICE KIT",1,0.2,45.3]
["18920-9043","SERVICE KIT 31605/31700",1,0.2,41]
[20381210,"SNAP-FIT PORT,90' 3/4   HOS",1,0.02,143]
[20403830,"KIT 426 DRIVE STO 3.5C",1,0.31,89.2]
[20407820,"VALVE HSNG VITON KIT",1,0.18,48.1]
[20407840,"VALVE HSNG EPDM KIT",1,0.18,48.1]
["22138B","MOTOR ASSY (22130)",1,10,1123.5999999999999]
["23007-1930","LABEL-CLOSE BOTH SEACOCKS",1,1E-3,1]
["23240-2000","ACCUMULATOR TANK 8L",1,3.68,145.80000000000001]
["23250-0000","ACCUMULATOR TANK 22L",1,5.6,168.4]
["28711-0000B","END COVER PISTON KIT",1,1,342.4]
["28714-0000B","CIP SCREW KIT",1,0.1,254.7]
["28715-0000B","CLAMP FRAME PFLO 700 KIT",1,1,557.29999999999995]
["28718-0000B","HANDLE ASSY-CIP EC KIT",1,0.2,400.3]
["29015-0000","VENTED LOOP 19MM (3/4 in )",1,0.03,29.2]
["29015-0010","VENTED LOOP 38MM (1-1/2  )",1,0.2,43]
["29015-0020","VENTED LOOP 25MM (1in)",1,0.4,51.6]
["29015-1000","VALVE KIT, X 2  29015",1,1E-3,11.7]
["29028-2000","PLUG KIT,BAYONET FIT,MTOILE",1,2.1000000000000001E-2,8.1999999999999993]
["29029-1000","DISCHARGE ELBOW (29090/120)",1,6.0999999999999999E-2,10.3]
["29035-1000","WHITE HOSE (29090/29200)",1,0.11,7.2]
["29035-1001","WHITE HOSE (29120/37010)",1,0.11,6.9]
["29035-1031","Hose (37045/245)",1,0.6,34.6]
["29040-3000","PUMP ASSY (29090/120-3000)",1,0.77200000000000002,83.3]
["29041-1000","BASE,PLUG & O RING ASSY",1,0.56299999999999994,52.1]
["29042-0000","TOP VALVE GASKET(29090/120)",1,0.04,8.8000000000000007]
["29043-0000","BASE VALVE GASKET(29090/120",1,3.9E-2,10.3]
["29044-0000","SEAL ASSY (29090/120-0000)",1,4.1000000000000002E-2,8.1999999999999993]
["29044-2000","SEAL ASSY (29090/120-2000)",1,4.4999999999999998E-2,9.1999999999999993]
["29044-3000","SEAL ASSY (29090/120-3000)",1,4.3999999999999997E-2,9.4]
["29045-2000","SERVICE KIT(29090/120-2000)",1,0.16800000000000001,37.5]
["29045-3000","SERVICE KIT(29090/120-3000)",1,0.16300000000000001,37.5]
["29046-3000","PISTON, ROD, & O RING ASSY",1,0.13300000000000001,23.3]
["29047-0000","MANUAL TOIL BASE2BOWL KIT",1,0.1,15.7]
["29051-2000","CYLINDER ASSY (29090/120)",1,0.48,38.6]
["29071-1000","MACERATOR HOUSING (29200)",1,0.16,35.299999999999997]
["29072-1000","BASE GASKET (29200)",1,0.02,5.0999999999999996]
["29075-1000","FLUSH PUMP GASKET (29200)",1,0.16,5.0999999999999996]
["29081-1000","FLUSH PUMP COVER ASSY",1,0.19,45.3]
["29083-1000","CONTROL VALVE (29200)",1,0.63,41.1]
["29090-5000","TOILET MAN R/H COMP",1,11,202.7]
["29090-5600","TOILET MAN R/H FR COMP",1,11,204]
["29090-5601","TOILET MAN L/H FR COMP",1,11,224.4]
["29091-1000","DISCHARGE FLANGE(29090/120)",1,3.3000000000000002E-2,7.2]
["29092-1000","JOKER VALVE(29090/120/59128",1,3.5999999999999997E-2,7.9]
["29094-3000","VALVE COVER (29090/29120-3)",1,0.28399999999999997,40.9]
["29096-0000","TOILET BOWL ONLY COMPACT",1,6,109.9]
["29096-0001","BOWL ONLY - COMPACT",1,8.5,109.9]
["29097-1000","COMPACT SEAT & LID WOOD",1,1.2,54.9]
["29098-1000","HINGE SET,COMPACT",1,0.1,10.6]
["29098-2000","HINGES-RGLR TLT SEAT(PRE2011)",1,0.1,11.3]
["29101-0000","SERVICE KIT (29200)",1,0.14000000000000001,72.5]
["29103-1000","SWITCH ASSY (29200)",1,0.03,21.6]
["29108-0120","MOTOR ASSY 12V (29200)",1,2.5299999999999998,247.9]
["29109-0000","HARDWARE KIT (29200)",1,0.12,45.2]
["29116-1000","WASTE & FLUSH PUMP BODY ASS",1,0.69,95.4]
["29120-5000","TOILET MAN R/H REG",1,11,244]
["29120-5100","TOILET MAN R/H REG SC",1,11,258.7]
["29120-5600","TOILET MAN R/H FR REG",1,12.5,268.39999999999998]
["29126-0000","TOILET BOWL ONLY, REGULAR",1,6.43,168.7]
["29126-0001","BOWL ONLY - LARGE",1,11.5,168.7]
["29127-1000","REGULAR TOILET SEAT WOOD",1,1.6,72.7]
["29135-1000","HOSE 19mm SANITARY (30.5m)",1,8,305.10000000000002]
["29135-1001","HOSE 38mm SANITARY (30.5m)",1,16.09,514.79999999999995]
["29135-1011","HOSE 25mm SANITARY (30.5m)",1,13.5,343.2]
["29200-0120","TOILET PUMP CONVERSION 12V",1,3.84,453.4]
["29200-0240","TOILET PUMP CONVERSION 24V",1,3.67,498.7]
["29230-0000","DIVERTER 25MM (1)",1,0.27,73.599999999999994]
["29230-0010","DIVERTER 38MM (1.5)",1,0.27,73.599999999999994]
["29243-1000","CLAMP RING & ROCKER (29240)",1,0.23,76.599999999999994]
["29246-1000","MAJOR SERVICE KIT (29240)",1,0.18,30.4]
["29250-0000","AMAZON THRUDECK 50LPM 1IN",1,1.248,88.8]
["29250-0010","AMAZON THRUDECK 50LPM 1.5IN",1,1.2729999999999999,97.7]
["29252-1000","CLAMP RING ASSEMBLY (29250)",1,0.21,25.5]
["29254-1000","ROCKER ASSY (29250)",1,0.28199999999999997,32.6]
["29256-1000","MAJOR SERVICE KIT (29250)",1,0.16700000000000001,31.8]
["29266-1000","AMAZON PUSH FIT ELBOW",1,0.04,8.1]
["29267-1000","HANDLE, 300mm (S.S.)",1,0.15,27]
["29270-0000","AMAZON UNIVERSAL 95LPM 1.5IN",1,1.0660000000000001,96.5]
["29272-1000","CLAMP RING & ROCKER (29270)",1,0.34499999999999997,42.4]
["29275-1000","PORTS KIT (29270)",1,9.4E-2,20.2]
["29276-1000","MAJOR SERVICE KIT (29270)",1,0.20699999999999999,30.4]
["29279-0000","AMAZON THRUDECK 50LPM 1.5IN",1,0.16,21.2]
["29280-0000","AMAZON WARRIOR 132LPM 1.5IN",1,4.82,527.9]
["29284-1000","ROCKER KIT (29280)",1,0.49,149.6]
["29286-1000","MAJOR SERVICE KIT (29280)",1,0.42,75.5]
["29287-1000","HANDLE (29280)",1,0.36,34.6]
["29289-0000","UNDERDECK BRACKET (WARRIOR)",1,0.55000000000000004,96.7]
["29290-1000","AMAZON STRAINER 25mm (1)",1,0.16500000000000001,22.5]
["29290-1010","AMAZON STRAINER 38mm (1.5)",1,0.17699999999999999,22.5]
["29290-1020","AMAZON STRAINER 19mm(3/4)",1,0.16,22.5]
["29295-1000","AMAZON NRV 25mm (1)",1,8.7999999999999995E-2,19.5]
["29295-1010","AMAZON NRV 38mm (1.5)",1,0.129,21.9]
["29295-1011","AMAZON NRV 19mm (3/4)",1,8.4000000000000005E-2,19.899999999999999]
["29295-1015","AMAZON NRV 38mm / 25mm (1 - 1 1/2)",1,0.108,21.5]
["29630-1301A","EC PUMP BRZ FLG 080 AM (CM)",1,3.6,1161.5999999999999]
["30002-0000","VALVES (34600)",1,5.6000000000000001E-2,59.5]
["30003-0000","VALVES (36600/680/960)",1,4.1000000000000002E-2,58.6]
["30004-0000","VALVES (36800/900/950)",1,4.8000000000000001E-2,45.3]
["30005-0000","VALVES (37202)",1,2.4E-2,40.799999999999997]
["30016-0000","DIAPHRAGM (36600/680/900)",1,4.1000000000000002E-2,65.099999999999994]
["30021-0000","BELT (34600/6800/6900)",1,0.03,24.9]
["30022-0000","BELT (36600/680/950)",1,2.7E-2,35.5]
["30101-0000","SERVICE KIT (34600)",1,0.1,110.3]
["30120-0000","SERVICE KIT (36960)",1,0.218,133.80000000000001]
["30121-0000","SERVICE KIT (36900)",1,0.19600000000000001,124.8]
["30122-0000","SERVICE KIT (36800)",1,0.2,149.6]
["30124-0000","SERVICE KIT (36600)",1,0.191,111.9]
["30126-0000","SERVICE KIT (36950/251)",1,0.16900000000000001,109.7]
["30573-0000","PRESSURISED ACCUM TANK 1L",1,0.7,95.2]
["30573-0003","MINI ACCUMULATOR TANK",1,0.6,46.7]
["30613-1001","VALVE KIT (30600/20/720/80)",1,6.8000000000000005E-2,42.5]
["30617-1000","DIAPHRAGM KIT (PAR-MAX 3&4)",1,3.1E-2,20.5]
["30642-1000","2xPORTS,19MM HOSE,90 DEGREE",1,0.03,13.2]
["30642-1004","PORTS 90 DEG 19MM HOS Viton",1,1.7999999999999999E-2,11.7]
["30647-1000","KIT: PORT CLIPS 7-19 LPM MODELS",1,3.2000000000000001E-2,4.4000000000000004]
["30648-1000","SNAP-FIT PORT CLIPS,PAIR",1,3.0000000000000001E-3,4.4000000000000004]
["30649-1000","KIT QD PORT ST EP QEST FDA",1,1.9E-2,14.7]
["30649-1004","PORTS 1/2   NPTViton",1,3.2000000000000001E-2,11.7]
["30651-1000","2xPORTS,13MM HOSE 90 DEGREE",1,2.4E-2,13.2]
["30651-1004","PORTS 90 DEG 13MM HOS Viton",1,1.6E-2,11.7]
["30653-1000","2xPORTS,19MM HOSE,STRAIGHT",1,2.1000000000000001E-2,14.7]
["30653-1004","PORTS 19MM HOSE Viton",1,1.6E-2,11.7]
["30654-1000","KIT  QD PORT ST EP .50HB FDA",1,1.4999999999999999E-2,14.7]
["30654-1004","PORTS 1/2    HOSE Viton",1,1.4999999999999999E-2,8.8000000000000007]
["30655-1000","KIT QD PORT ELB EP QEST FDA",1,0.09,5.8]
["30682-1000","PLATE/PISTON KIT (PAR-MAX)",1,8.3000000000000004E-2,33.700000000000003]
["30703-1000","SPRAY NOZZLE 3/4  GHT(USA)",1,0.96,29.3]
["31295-3512-3A","PARMAX 2 12V 7.6LPM 35PSI",1,2.2599999999999998,97.8]
["31295-3524-3A","PARMAX 2 24V 7.6LPM 35PSI",1,2.23,113.2]
["31331-0092","RINSEPUMP,12V,DF TOILETS",1,1.53,119.8]
["31331-0094","RINSEPUMP,24V,DF TOILETS  V",1,1.8,124.4]
["31395-2512-3A","PARMAX 3 12V 11LPM 25PSI",1,2.2400000000000002,102.9]
["31395-2524-3A","PARMAX 3 24V 11LPM 25PSI",1,2.2000000000000002,113.2]
["31395-4012-3A","PARMAX 3 12V 11LPM 40PSI",1,2.2200000000000002,102.9]
["31395-4024-3A","PARMAX 3 24V 11LPM 40PSI",1,2.2200000000000002,109.4]
["31631-0092","PAR-MAX 3 TOILET PUMP 12V",1,2.35,210.9]
["31631-0094","PAR-MAX 3 TOILET PUMP 24V",1,5.16,227.9]
["31910-1225","KIT ASSEMBLY HOSE 25' X4 COIL",1,0,57.2]
["31911-0000","S/S D/WASH CONN,GHT,RETAIL",1,0.52,111.9]
["31911-0002","3/4  GHT ADAPTOR(31911-0000",1,0.11,52.4]
["31911-0004","S/S D/WASH CONN,BSP,OEM",1,0.52,113.2]
["31911-0005","3/4  BSP ADAPTOR(31911-0004",1,8.9999999999999993E-3,63.7]
["31911-0007","SS D/WASH CONN,BSP,RETAIL",1,0.53500000000000003,101.9]
["32305-5012-3A","HOTSHOT 3 12V 11LPM 50PSI",1,2.5,167.3]
["33799-0000","UTILITY HAND PUMP 26S/GL 1/2IN",1,0.83699999999999997,89.2]
["34060-0010","UTILITY HAND PUMP 40S/GL 1/2IN",1,0.41,54]
["34739-0010","BLOWER 150CFM FLANGE 12V",1,2.0299999999999998,174.6]
["34739-0010EU","FLNGM,12V,3IN,150CFM EU",1,0,158.69999999999999]
["34739-0020","FLNGM,24V,3IN,150CFM",1,2.0299999999999998,174.6]
["34739-0020EU","FLNGM,24V,3IN,150CFM EU",1,0,158.69999999999999]
["35115-0020","BLOWER 105CFM FLANGE 12V",1,1.24,111.2]
["35115-0020EU","FLNGM,12V,3IN,105CFM EU",1,0,111.2]
["35400-0000EU","FLNGM,12V,4IN,250CFM EU",1,0,212.7]
["35400-0010","BLOWER 250CFM FLANGE 24V",1,2.57,212.7]
["35400-0010EU","FLNGM,24V,4IN,250CFM EU",1,0,193.4]
["35440-0000EU","FLXMT,12V,4IN,250CFM EU",1,0,193.4]
["35440-0010EU","FLXMT,24V,4IN,250CFM EU",1,0,193.4]
["35445-0000","WASHERS (PAR WPS)",1,1E-3,1.9]
["35503-0000","DIAPHRAGM PLATE",1,1.6E-2,13.2]
["35515-0010EU","FLXMT,12V,3IN,105CFM EU",1,0,111.2]
["35714-0000","BLOWER WHEEL 100mm (4)",1,0.06,23.3]
["35760-0092","HD FLANGEMOUNT BLOWER 12V",1,3.4,290.39999999999998]
["35760-0094","HD FLANGEMOUNT BLOWER 24V",1,3.4,290.39999999999998]
["35770-0092","HD FLEXMOUNT BLOWER 12V",1,3.4,264]
["35770-0094","HD FLEXMOUNT BLOWER 24V",1,3.4,264]
["36138-0000","FILTER SCREEN #50 (FINE)",1,5.0000000000000001E-3,11.7]
["36139-0000","FILTER SCREEN #16 (COARSE)",1,1.4999999999999999E-2,14.7]
["36403-0000","O-RING(36200/36400)",1,1E-3,1.5]
["36740-0000","BLOWER 150CFM FLEX. 12V",1,2.3199999999999998,174.6]
["36740-0000EU","FLXMT,12V,3IN,150CFM EU",1,0,158.69999999999999]
["36740-0010","BLOWER 150CFM FLEX. 24V",1,2.34,158.69999999999999]
["36740-0010EU","FLXMT,24V,3IN,150CFM EU",1,0,158.69999999999999]
["37003-1000","KIT 37010 BASE SCREW COVERS",1,0.04,9.1]
["37004-1000","BASE ASSY (37010)",1,0.45,109.1]
["37006-0000","CENTRIF.IMPELLER (37010)",1,0.14000000000000001,26.7]
["37010-0092","ELECTRIC TOILET CONV KIT 12V",1,3.64,393.4]
["37010-0097","ELECTRIC TOILET CONV KIT 24V",1,3.73,432.7]
["37010-3092","TOILET ELEC 12V COMP",1,15,441.4]
["37010-3094","TOILET ELEC 24V COMP",1,15,441.4]
["37010-4092","TOILET ELEC 12V REG",1,15,444]
["37010-4094","TOILET ELEC 24V REG",1,15,488.5]
["37010-4192","TOILET ELEC 12V REG SC",1,15,458.7]
["37010-4194","TOILET ELEC 24V REG SC",1,15,504.6]
["37014-0000","MACERATOR HOUSING (37010)",1,0.04,27]
["37017-0000","BASE GASKET(37010)PRE 1999",1,0.04,5.0999999999999996]
["37018-0000","WEARPLATE/SEAL KIT (37010)",1,0.21,38.1]
["37020-0000","PUSH SWITCH (37010)",1,0.1,62.8]
["37038-2012","SOLENOID/NRV KIT 12V (TOILET)",1,0.36,150.6]
["37038-2024","SOLENOID/NRV KIT 24V (TOILET)",1,0.36,150.6]
["37040-0000","SERVICE KIT (37010)",1,0.17,75.099999999999994]
["37041-0010","MOTOR/PUMP ASSY 12V (37010) EMC",1,2.5299999999999998,405.4]
["37041-0011","MOTOR/PUMP ASSY 24V (37010) EMC",1,2.5299999999999998,405.4]
["37042-1000","MOTOR COVER (37045/245)",1,0.14000000000000001,20.100000000000001]
["37043-1000","SEAL HOUSING  (37045/245)",1,0.18,21.6]
["37047-2000","SWITCH PANEL (37045/245)",1,0.18,87]
["37055-0092","QF CONVERSION KIT W/SOLND 12V",1,3.83,781.8]
["37055-0094","QF KIT W/SOLND 24V",1,3.78,781.8]
["37056-1000","CHOPPER & LOCK NUT (TOILET)",1,0.02,9.5]
["37056-2000","CHOPPER/LOCK NUT -MACERATOR",1,1.0999999999999999E-2,8.5]
["37064-0000","MOTOR 12v (37010) (Now CE)",1,1.82,277.2]
["37068-2000","SOLENOID VALVE KIT (37010)",1,0.16,66.900000000000006]
["37072-0092","MOTOR/WASTE PUMP ASSY 12V (QF/DS)",1,1.63,212]
["37072-0094","MOTOR/WASTE PUMP ASSY 24V (QF/DS)",1,2,208]
["37077-1000","PORT 22MM 90DEG (37075/275)",1,2.5000000000000001E-2,9.1999999999999993]
["37121-0010","HP SWITCH KIT 40psi ALL WPS",1,0.09,46.7]
["37174-0000","DIAPHRAGM (37202/05/15)",1,2.8000000000000001E-2,22.9]
["37178-0000","PULSATION DAMPENER",1,0.107,46.9]
["37182-0000","SERVICE KIT (37202)",1,0.13400000000000001,100.2]
["37202-2012","PUMP BILGE/SHOWER DRAIN CE",1,2.0510000000000002,276.60000000000002]
["37202-2024","SHOWER/BILGE DRAIN PUMP 24V",1,2.0510000000000002,304.3]
["37255-0092","QF CONV KIT W/PUMP 12V",1,5.68,781.8]
["37255-0094","QF KIT W/PUMP 24V",1,5.73,781.8]
["38045-3092","QFE2 TOILET W/SOL CMPCT 12V",1,14.8,849.8]
["38045-3094","QFE2 TOILET W/SOL CMPCT 24V",1,14.8,853.5]
["38045-4192","QFE2 TOILET W/SOL REG 12V",1,17.3,865.1]
["38045-4194","QFE2 TOILET W/SOL REG 24V",1,17.3,868.7]
["38245-3092","QFE2 TOILET W/PUMP CMPCT 12V",1,15.9,849.8]
["38245-3094","QFE2 TOILET W/PUMP CMPCT 24V",1,15.9,853.5]
["38245-4192","QFE2 TOILET W/PUMP REG 12V",1,18.600000000000001,865.1]
["38245-4194","QFE2 TOILET W/PUMP REG 24V",1,18.600000000000001,868.7]
["38503-1000","QFE2 BASE ASSEMBLY",1,0.8,72.7]
["38505-1000","QFE2 PORT KIT STRAIGHT",1,0.1,18.8]
["38506-1000","QFE2 PORT KIT 90 DEG",1,0.1,18.8]
["38508-1000","QFE2 TOILET BASE COVER",1,0.8,21.7]
["38572-0092","QFE2 PUMP ASSY KIT 12V",1,5.15,238]
["38572-0094","QFE2 PUMP ASSY KIT 24V",1,5.15,238]
["38580-1000","QFE2 CONTROL KIT",1,1.2,151.69999999999999]
["38595-1000","QFE2 SERVICE KIT",1,0.1,32.799999999999997]
["42630-3512-3C","PARMAX 1 12V 3.8LPM 35PSI",1,1.8,93.4]
["42634-0000","KIT PRESSURE SWITCH  35 PSI",1,0.06,29.3]
["43003-1851","LABEL WARNING (FLOODING)",1,1E-3,1]
["43670-0003","RCL CONTROL,12V",1,0.2,303.60000000000002]
["43990-0013","EXTENSION HARNESS 3M/10FT",1,0.45,101.5]
["43990-0014","EXTENSION HARNESS 4.5M/15FT",1,0.6,130.4]
["43990-0015","EXTENSION HARNESS 7.6M/25FT",1,1.9,195.1]
["43990-0016","EXTENSION HARNESS 11M/35FT",1,2.4,318.3]
["43990-0040","BULB RETAINING RING (62042)",1,0.24,87.6]
["43990-0046","RUBBER BOOT (61040/41/42)",1,0.13,59.1]
["43990-0051","MOTOR COVER (37010)",1,0.31,27.4]
["43990-0061","SERVICE KIT(36950/251-2XXX)",1,0.22500000000000001,147.1]
["43990-0062","SERVICE KIT (36680-2XXX)",1,0.16500000000000001,99.3]
["43990-0063","SERVICE KIT (36960-2XXX)",1,0.22,109.7]
["43990-0066","O-RING (37010, 37045, 37245)",1,5.0000000000000001E-3,3.1]
["43990-0069","GEAR CLUTCH KIT(5,7,8 RCL)",1,3.7999999999999999E-2,67.900000000000006]
["43990-0076","MOTOR/CLUTCH ASSY,62040/42",1,1.17,569.1]
["43990-0078","MOTOR/PIN,VERT/HORZ,62022/40/42",1,0.14000000000000001,108.4]
["44050-1000","HP SWITCH KIT 50psi W'DOWN",1,0.17199999999999999,52.4]
["44070-0000","BOWL THREADED (36200/400)",1,0.01,5.4]
["44101-1000","BOWL O-RING (ELECT TOILETS)",1,0.01,6]
["44106-1000","JOKER VALVE [37010/QF/DS]",1,0.01,7.6]
["44107-1000","PORT 1   PLASTICDIS(37010)",1,0.02,8.5]
["44411-0045","REGULATOR IN-LINE 45 PSI WHITE",1,0.11600000000000001,41.1]
["44411-1045","REGULATOR W/MOUNT 45 PSI WHITE",1,0.25,46.9]
["44411-2045","REGULATOR W/MOUNT 45 PSI CHR.",1,0.24,52.8]
["44412-1045","REGULATOR W/MOUNT 45 PSI WHITE",1,0.27,46.9]
["44412-2045","REGULATOR W/MOUNT 45 PSI CHR.",1,0.23,52.8]
["44814-1000","KIT P/S 20PSI E UNI",1,0.1,46.7]
["45488-0000","SERVICE KIT (45490)",1,0.02,18.600000000000001]
["45490-1000","Y-VALVE, SWIVEL PORTS",1,0.61199999999999999,70.900000000000006]
["45493-0000","KIT, Y-VALVE HANDLE",1,0.06,11]
["45500-1000","HANDLE EXTENSION (45490)",1,0.1,10.3]
["46200-0000","PUMPGARD,INLINE,3/4  HB,#20",1,0.10299999999999999,19.100000000000001]
["46200-0010","PUMPGARD,SNAP-IN,3/4  HB,#2",1,1.2E-2,20.5]
["46400-0000","PUMPGARD,INLINE,3/4  HB,#40",1,0.14599999999999999,19.100000000000001]
["46400-0002","PUMPGARD,INLINE,1/2  HB,#40",1,0.17499999999999999,19.100000000000001]
["46400-0003","PUMPGARD,INLINE,3/8  HB,#40",1,0.2,20.5]
["46400-0004","PUMPGARD,INLINE,1/2  QEST#4",1,0.187,19.100000000000001]
["46400-0010","PUMPGARD,SNAP-IN,3/4  HB,#4",1,0.1,19.100000000000001]
["46400-0012","PUMPGARD,SNAP-IN,1/2  HB,#4",1,0.01,19.100000000000001]
["46400-0014","PUMPGARD,SNAP-IN,1/2  QEST#",1,0.17899999999999999,20.5]
["46400-0030","MINI PUMPGUARD,SNAP-IN",1,0.05,17.399999999999999]
["46400-0711","PUMPGARD [41750/5 WPS]",1,0.1,27.9]
["46400-9500","PUMPGARD,2xSNAP-IN, #40",1,0.1,17.600000000000001]
["50092-1000","BRACKET KIT",1,7.5999999999999998E-2,18.600000000000001]
["50094-1000","KIT BOTTOM PLATE",1,7.2999999999999995E-2,25.3]
["50095-1000","MAJOR SERVICE KIT (37202-2)",1,0.13500000000000001,55.7]
["50097-1000","CON ROD KIT (37202-2)",1,0.115,59.4]
["50099-1000","DIAPHRAGM KIT (37202)",1,1.4999999999999999E-2,11.9]
["50440-1501A","EC PUMP BRZ FLG 080 AM (CM)",1,0,1161.5999999999999]
["50540-1201A","EC PUMP BRZ FLG 120 AM (CM)",1,4,1718.2]
["50690-0101A","EC PUMP BRZ FLG 120 AM (CM)",1,6,1918.4]
["50835-0000","KIT SEAL (CYCLONE LP)",1,0.04,38.200000000000003]
["50840-0012","CYCLONE LP NPT 12V",1,3.18,349.1]
["50840-0024","CYCLONE LP NPT 24V",1,1.84,349.1]
["50840-2012","CYCLONE LP BSP 12V",1,3.14,349.1]
["50840-2024","CYCLONE LP BSP 24V",1,3.16,349.1]
["50850-2012","CYCLONE HYBRID BSP 12V",1,4,257.89999999999998]
["50860-0024","CYCLONE HP NPT 24V",1,4.9000000000000004,418.7]
["50860-2012","CYCLONE HP BSP 12V",1,4.7300000000000004,418.7]
["50860-2024","CYCLONE HP BSP 24V",1,4.93,418.7]
["50875-0000","KIT SEAL (CYCLONE HP)",1,1E-3,38.200000000000003]
["50880-1000","SHOWER DRAIN PUMP 12V",1,2.42,158.30000000000001]
["50880-1100","PUMP,SHOWER DRAIN,24V",1,2.42,158.30000000000001]
["50886-1000","CLAMP RING KIT - 508X0 SERIES",1,0.7,22.7]
["50890-1000","DIAPHRAGM WASTE PUMP 12V",1,2.81,232.9]
["50890-1100","DIAPHRAGM WASTE PUMP 24V",1,2.4500000000000002,232.9]
["52503-1000","2 LITRE ACCUMULATOR TANK KIT",1,0.7,94.8]
["52512-1012B","WPS RELAY KIT 12V",1,0.02,18]
["52512-1024B","WPS RELAY KIT 24V",1,0.02,18]
["52514-1000","BSP TEE KIT",1,0.05,13.2]
["52520-1000","12V WPS SINGLE STACK",1,8,485.1]
["52530-1000","12V WPS - DOUBLE STACK",1,8,802.9]
["52530-1100","24V WPS - DOUBLE STACK",1,8,802.9]
["52530-3000","12V WPS - DOUBLE STACK 22",1,8,661]
["52530-3100","24V WPS - DOUBLE STACK 22",1,8,661]
["52640-1000","JABSCO TOILET FRESH GEL BOTTLE",1,1.1000000000000001,9.8000000000000007]
["58020-3012","TOILET DF17A 12V W/S",1,0,855.8]
["58020-3024","TOILET DF17A 24V W/S",1,0,855.8]
["58028-1000","BOWL,ANGLED-DF TOILET",1,18.239999999999998,357.9]
["58029-1000","CONTROL KIT-DF TOILET",1,0.48,134.69999999999999]
["58038-1000","BOWL,VERTICAL-DF TOILET",1,19,388.7]
["58039-1000","DELUXE FLUSH HOSE KIT",1,0,63.2]
["58040-3012","TOILET DF17V 12V W/S SC",1,26,836.1]
["58040-3012M","TOILET DF17V 12V RV SC",1,26,919.7]
["58040-3024","TOILET DF17V 24V W/S SC",1,26,919.7]
["58048-1000","BOWL, DF SLANT BACK",1,18.239999999999998,409.2]
["58060-3012","TOILET DF14A 12V W/S",1,24,855.8]
["58060-3024","TOILET DF14A 24V W/S",1,24,855.8]
["58068-1000","BOWL, DF STRAIGHT BACK",1,18.239999999999998,409.2]
["58080-3012","TOILET DF14V 12V W/S",1,0,919.7]
["58080-3024","TOILET DF14V 24V W/S SC",1,27,919.7]
["58100-2000","MAJOR SERVICE KIT",1,0.77,130.5]
["58101-1000","CERAMIC SEAL KIT-DELUXFLUSH",1,0.26,87.9]
["58103-1012","PUMP ASSEMBLY 12V-DF TOILET",1,3.94,406.3]
["58103-1024","PUMP ASSEMBLY 24V-DF TOILET",1,4.22,425.4]
["58104-1000","SEAT AND LID SET",1,2.88,81.7]
["58104-2000","REGULAR SEAT/LID - SOFT CLOSE",1,1.6,99.5]
["58105-1000","HINGE KIT-DF TOILET",1,0.09,15.4]
["58105-3000","HINGE KIT - SOFT CLOSE 2020",1,7.0000000000000007E-2,38.299999999999997]
["58107-1000","INTAKE ELBOW AND SEAL KIT",1,0.1,19.100000000000001]
["58109-1000","NON RETURN VALVE KIT",1,0.2,27]
["58220-3012","TOILET DF17A 12V W/P",1,0,855.8]
["58220-3024","TOILET DF17A 24V W/P",1,0,855.8]
["58240-3012","TOILET DF17V 12V W/P SC",1,26,919.7]
["58240-3024","TOILET DF17V 24V W/P SC",1,26,919.7]
["58260-3012","TOILET DF14A 12V W/P",1,27,855.8]
["58260-3024","TOILET DF14A 24V W/P",1,0,855.8]
["58280-3012","TOILET DF14V 12V W/P SC",1,0,919.7]
["58280-3024","TOILET DF14V 24V W/P SC",1,0,919.7]
["58500-0012","LITE FLUSH 12V - FOOT SWITCH",1,14.2,904.9]
["58500-1012","LITE FLUSH 12V - PANEL VERSION",1,11,969.4]
["58514-1000","TOP BOWL SEAL",1,1E-3,49.9]
["58530-1000B","SEAT & LID",1,1.2,47.8]
["58540-1012","PUMP ASSEMBLY KIT 12V",1,3.88,341.8]
["58540-1024","PUMP ASSEMBLY KIT 24V",1,3,341.8]
["58541-1000","PULLEY AND BELT KIT",1,0.2,44.7]
["58542-1000","REPLACEMENT BELT KIT - LITE FLUSH",1,1.6E-2,43.2]
["58550-1000","HOSE KIT",1,0.1,55.9]
["58552-1000","CONTROL KIT )PANEL)",1,0.2,149.6]
["59000-1000","AQUA FILTA, COMPLETE",1,0.7,58.5]
["59100-0000","CARTRIDGE, AQUA FILTA",1,0.5,36.1]
["59451-0024","ULTRA-MAX 13L 24V LP",1,3,419]
["59520-0000B","PUMP MAG DRIVE BRASS 8-24V",1,1,359.5]
["59530-0000B","PUMP MAG DRIVE NORYL 8-24V",1,0.6,359.5]
["60030-0000","CONTROL STATION (135SL)",1,0.13,121.4]
["60070-0000","RCL CONTROL 24V (60010)",1,0.32,438.6]
["82405-0094","24V 4GPM 70PSI WD KIT R5N",1,3,291.60000000000002]
["90197-0000","SERVICE KIT (37045/245)",1,0.04,20.3]
["91027-0011","SCREW (37010)",1,0.13,2.2999999999999998]
["91045-6006","MOTOR SCREW (37045/245)",1,4.0000000000000001E-3,0.7]
["91084-0320","SET SCREW (37010)",1,0.01,8.1999999999999993]
["91085-0340","KIT ACORN NUT (3 PER BAG)",1,1E-3,7.2]
["92700-0910","SEAL LIP 5/16IDx3/4ODx.172",1,2E-3,18.899999999999999]
["929000380A","KIT JABSCO GROMMETS",1,1.0999999999999999E-2,6.4]
["93003-0240","15.87x25mm (Length) clear PVC",1,1E-3,6]
["96050-0568","SCREW (PRESS.SWITCH ADAPT.)",1,0.01,4.4000000000000004]
["98023-0080","ADAPTOR 25mm-38mm (37010)",1,0.15,15.3]
["ID20","INFLATOR/DEFLATOR 12V",1,0.75600000000000001,100.5]
["ID20K","ADAPTOR KIT FOR RULE ID20",1,0.08,11.1]
["IL200","200GPH IL PMP, 1/2 12V",1,0.20899999999999999,27.1]
["IL200K","PORTABLE PUMPING KIT 200GPH",1,0.60099999999999998,54.4]
["IL200P","200GPH IL PMP, 1/2 12V",1,0.316,42.4]
["IL200P-24","200GPH IL PMP, 1/2 24V",1,0.316,46.7]
["IL280P","280GPH IL PMP, 1/2 12V",1,0.42199999999999999,50.8]
["IL280P-24","280GPH IL PMP, 1/2 24V",1,0.42199999999999999,61.5]
["IL280PK","280GPH IL PMP, 1/2 12V KIT",1,0.73799999999999999,75.5]
["IL280PK-24","280GPH IL PMP, 1/2 24V KIT",1,0.73799999999999999,90.5]
["IL500P","500GPH IL PMP, 3/4 12V KIT",1,0.502,64.099999999999994]
["IL500P-24","500GPH IL PMP, 3/4 24V KIT",1,0.496,77.599999999999994]
["IL500PK","PORTABLE PUMPING KIT 500GPH",1,0.90200000000000002,97.4]
["IL500PK-24","PORTABLE PUMPING KIT 24V",1,1.054,107.1]
["LP900D","LoPro Man 900GPH, 12V Bilge Pump",1,0.66,56.8]
["LP900S","900,LOPRO,BILGE PUMP,12V",1,0.66,79.900000000000006]
["RM1100B","RM1100,BILGE PUMP,12V",1,0.6,119.9]
["RM1100B-24","RM1100,BILGE PUMP,24V",1,0.6,122.8]
["RM1500A","1500RM,BILGE PUMP,12V",1,1.95,194.7]
["RM2000A","2000RM,BILGE PUMP,12V",1,1.97,226.7]
["RM2000A-24","2000RM,BILGE PUMP,24V",1,1.97,232]
["RM500B","RM500,BILGE PUMP,12V",1,0.6,73.099999999999994]
["RM500B-24","RMIII BILGE,500 GPH,24V,RETAIL",1,0.6,93.1]
["RM800B","RM800,BILGE PUMP,12V",1,0.6,91.2]
["RM800B-24","RMIII BILGE,800 GPH,24V,RETAIL",1,0.6,103.8]
[2,"1500STD,BILGE PUMP,12V",1,1.49,94.8]
[45810,"1500STDPMP,12,NP,NCV",1,1.49,120.3]
[3,"1500STD,BILGE PUMP,24V",1,1.49,102]
[4,"15005YR,BILGE PUMP,12V",1,1.59,136.69999999999999]
[9,"20005YR,BILGE PUMP,12V",1,1.6,172]
[10,"2000STD,BILGE PUMP,12V",1,1.56,131.19999999999999]
["10D2M","2000STDPMP,12,NP,NCV,DT",6,1.56,154]
["10M","2000STDPMP,12,NP,NCV",6,1.56,129.19999999999999]
[12,"2000STD,BILGE PUMP,24V",1,1.56,141.30000000000001]
["12M","2000STDPMP,24,NP,NCV",6,1.56,138.69999999999999]
["1200R","Rule 3/4\" NPSM 3/4\" Barb",1,3.4000000000000002E-2,9.5]
["1201R","Rule 3/4\" NPSM 3/4\" Barb 90degree",1,4.5999999999999999E-2,10]
["1202R","Rule 3/4\" NPSM 1\" Barb",1,4.4999999999999998E-2,11.6]
["1203R","Rule 1\" NPSM 3/4\" Barb 90 degree",1,5.2999999999999999E-2,11.9]
["1204R","Rule 1\" NPSM 3/4\" Barb",1,4.4999999999999998E-2,11.5]
["1205R","Rule 1\" NPSM 1\" Barb 90 degree",1,6.4000000000000001E-2,9]
["1206R","Rule 1\" NPSM 1\" Barb",1,4.5999999999999999E-2,13.4]
["1207R","Rule 1\" NPSM 1-1/8\" Barb 90degree",1,7.0999999999999994E-2,10.4]
["1208R","Rule 1\" NPSM 1-1/8\" Barb",1,5.0999999999999997E-2,10.6]
["1220R","3/4\" check valve, 3/4\" flange",1,1.7000000000000001E-2,6.9]
["1221R","3/4\" check valve, 1\" flange",1,1.7000000000000001E-2,6.9]
["1222R","1\" check valve, 1\" flange",1,1.7000000000000001E-2,6.6]
["1223R","1-1/8\" check valve, 1\" flange",1,1.7000000000000001E-2,6.6]
["1240R","CHECK VALVE, 97A/98A ONLY",1,0.4,8.4]
["1242R","LID/GASKET KIT 98B/99B",1,0,26.6]
["13A","37005YR,BILGE PUMP,12V",1,2.9,311]
["14A","3700STD,BILGE PUMP,12V",1,2.9,214.7]
[140,"INLIN,12V,3IN,140CFM",1,0.54,35.299999999999997]
["140-24V","INLIN,24V,3IN,140CFM",1,0.52,44.7]
["16A","3700STD,BILGE PUMP,24V",1,2.9,222.7]
["16AD2","3700STDPMP,24,NP,NCV,DT",1,2.9,246.4]
["16AM","3700STDPMP,24,NP,NCV",2,2.9,240.6]
[165,"RULE HAND PUMP  30LPM 24IN HSE",1,0.45,56.6]
["17A","3700STD,BILGE PUMP,12V",1,3.13,237.4]
["18A","3700STD,BILGE PUMP,24V",1,3.13,249.4]
["20DA","800,STD,BILGE PUMP,12V",1,0.41,44]
["20DA-24","800,STD,BILGE PUMP,24V",1,0.41,52.1]
["20SA","800,AUTO,BILGE PUMP,12V",1,0.49299999999999999,95.3]
["209B","PUMP 1600 12V LW BRONZE BASE",1,1.93,266.89999999999998]
["209FDP","PUMP 1600 12V LW DUAL PORT",1,1.63,174.7]
[212,"Y FITTING 3/4  (19mm) HOSE",1,0.8,19.5]
["24DA","360,STD,BILGE PUMP,12V",1,0.40500000000000003,23.1]
["24DA-35A","360 Pump and Switch Combo, 12V",1,0.54300000000000004,60.4]
[240,"INLIN,12V,4IN,240CFM",1,0.5,38.4]
["240-24V","INLIN,24V,4IN,240CFM",1,0.57999999999999996,46.7]
["25DA","500,STD, BILGE PUMP,12V",1,0.4,27.7]
["25DA-ANAAA","500STDPUMP,3/4\",12,NCV,DT",1,0.37,30.1]
["25DA-24","500,STD, BILGE PUMP,24V",1,0.38,34.200000000000003]
["25DA-35A","500 Pump and Switch Combo, 12V",1,0.53,67]
["25SA","500,AUTO,BILGE PUMP,12V",1,0.42699999999999999,74.900000000000006]
["25SA-24","500,AUTO,BILGE PUMP,24V",1,0.436,94.3]
["25SA-6","500,AUTO,BILGE PUMP,12V",1,0.41,86.4]
["27DA","1100,STD,BILGE PUMP,12V",1,0.45,47.1]
["27DA-JNNNA","1100STDPUMP,1 1/8\",12,NCV",1,0.4,50.2]
["27DA-24","1100,STD,BILGE PUMP,24V",1,0.5,56.2]
["27SA","1100,AUTO,BILGE PUMP,12V",1,0.52,114.5]
["27SA-24","1100,AUTO,BILGE PUMP,24V",1,0.53200000000000003,161.6]
[275,"RULE BASE 360-1100GPH",1,0.01,6]
[278,"RULE BASE 1500-2000GPH",1,7.0000000000000007E-2,18.7]
[279,"RULE BASE 2800-3700GPH",1,0.4,11.5]
["29240-0000","AMAZON BULKHEAD 45LPM 1IN",1,0.82,92.6]
["32ALA","HIGH WATER BILGE ALARM 24V",1,0.13900000000000001,86.1]
["33ALA","HIGH WATER BILGE ALARM 12V",1,0.31900000000000001,76.5]
["35A","FLT SW RULE",1,0.16,34.299999999999997]
["35AM","FLT SW RULE BULK",30,0.2,38.700000000000003]
["35FA","RULE-A-MATIC WITH FUSE",1,0.16,39.200000000000003]
["37A","FLT SW RULE-SUPER",1,0.18,51.7]
["37FA","SUPER SWICH WITH FUSE",1,0.2,53.5]
[39,"FLT SW ECO-12",1,0.192,63.2]
["39-24","FLT SW ECO-24",1,0.192,65.7]
["40A","FLT SW RULE-PLUS",1,0.31,43.3]
["40FA","FLT SW RULE-PLUS W/F BULK",1,8.9999999999999993E-3,46.8]
["401C","LIVEWELL 500 ANGLED THRU HULL",1,1.02,50]
["401FC","LIVEWELL 500 STRAIGHT SEACOCK",1,8.9999999999999993E-3,47.7]
["401STC","LIVEWELL 500 STRAIGHT THRU HULL",1,0.3,48.9]
["403C","LIVEWELL 800 ANGLED THRU HULL",1,0.7,56.9]
["403FC","LIVEWELL 800 STRAIGHT SEACOCK",1,0.62,50.4]
["403STC","LIVEWELL 800 STRAIGHT THRU HULL",1,2,50.9]
["405C","LIVEWELL 1100 STRAIGHT THRU HULL",1,0.74,60.6]
["405FC","LIVEWELL 1100 STRAIGHT SEACOCK",1,4.8,51.1]
["405STC","LIVEWELL 1100 STRAIGHT THRUHULL",1,0.72,61.2]
[41,"DELUXE PANEL SWITCH 12V",1,0.11,33.200000000000003]
[42,"DELUXE PANEL SWITCH 24/32V",1,0.11,39.9]
[43,"DELUXE ROCKER SWITCH 12V",1,0.09,36.4]
[44,"DELUXE ROCKER SWITCH 24/32V",1,0.09,42.4]
[45,"STD PANEL SWITCH 12/24V",1,7.0000000000000007E-2,30.8]
["45DR","500GPH CARTRIDGE MOTOR",1,0.34,28.3]
["46DR","800GPH CARTRIDGE MOTOR",1,0.39,34.4]
["47DR","1100GPH CARTRIDGE MOTOR",1,0.39,37.1]
[49,"SWITCH 2 WAY PANEL 12/24V",1,7.0000000000000007E-2,28.4]
["51S","1500AUTO,BILGE PUMP,12V",1,2.23,194.7]
["53S","2000AUTO,BILGE PUMP,12V",1,2.23,254.7]
["55S","3700AUTO,BILGE PUMP,12V",1,3.13,360.8]
["56D","4000STD,BILGE PUMP,12V",1,2.9,220]
["56D-24","4000STD,BILGE PUMP,24V",1,2.9,272]
["56S","4000AUTO,BILGE PUMP,12V",1,3.13,390.2]
[60,"THRU HULL FITTING 1-1/8",1,0.112,10.6]
[61,"THRUHULL FITTING 3/4 90",1,7.0000000000000007E-2,9.8000000000000007]
["61S","THRUHULL FITTING 3/4 ST",1,0.112,9.5]
[62,"THRUHULL FITTING 5/8 90",1,7.0000000000000007E-2,10.1]
[66,"SIDE MOUNT BRACKET RULE 360-1100",1,7.0000000000000007E-2,6.9]
["66A","BRACKET-360-1100GPH BILGE PMPS",1,7.2999999999999995E-2,20]
[73,"LIVEWELL DEBRIS STRAINER",1,7.0000000000000007E-2,12.6]
["7700D","UTILITY PUMP, 7700GPH, 12V, 3\"",1,4.9889999999999999,502.3]
[78,"AERATOR SPRAY HEAD",1,7.0000000000000007E-2,17.2]
["98B","SHOWER SUMP, 800GPH,12V,RETAIL",1,1.887,165.3]
["98B-24","SHOWER SUMP, 800GPH,24V,RETAIL",1,1.8,169.4]
["99B","SHOWER SUMP,1100GPH,12V,RETAIL",1,1.8,174.7]
["99B-24","SHOWER SUMP,1100GPH,24V,RETAIL",1,1.8,199.5]
["23874-2050","BODY-FUEL PUMP 35L",1,0.28999999999999998,63.8]
["CW269","ACC TANK 2 LITRE",1,1.1950000000000001,48.3]
["CW288","ACC TANK 8 LITRE",1,2.88,61.6]
["CW291","ACC TANK 20 LITRE WITH S/S END",1,7,86.6]
["CW322","ACC TANK FITTING KIT 1/2  BSP",1,0.20499999999999999,22]
["CW323","ACC TANK FITTING KIT 3/4  BSP",1,0.36,26.2]
["CW324","ACCUMULATOR TANK BRACKET KIT",1,0.19500000000000001,26.4]
["CW385","ACC TANK 5 LITRE",1,2.0499999999999998,51.4]
["CW425","OBS  MAXI-SYSTEM 4+5 12V",1,6.72,371.1]
["CW445","FRESH WATER STRAINER 1 INCH",1,0.26,60.1]
["CW462","OBS MAXI-SYSTEM 2.9+2 12V",1,3.85,243.5]
["CW474-324","FLOJET DIA PUMP HORIZ PORTS DISCHARGE RIGHT",1,6.39,481.9]
["CW474-424","230V WPS 13LPM ADJ/SW",1,7.21,529.5]
["CW476","SS ACC TANK 24LTR",1,8.09,287.5]

{"sheet":"Service Parts","index":2,"n_rows":927,"n_cols":20,"rows_kept":927,"cut":false,"hidden":false,"merged":[]}
["JABSCO PUMP PARTS"]
["MODEL NUMBER","PUMP \nSIZE","PORT\nTYPE","MOUNT TYPE","ALTERNATE PUMP NUMBER","KIT NUMBER","GASKET/ O-RING","IMPELLER-P","WATER SEAL","END COVER SCREWS","CAM","CAM SCREW","PUMP END OIL SEAL","PUMP END BEARING","DRIVE END OIL SEAL","DRIVE END BEARING","SHAFT","WEARPLATE","END COVER","BODY"]
[3570,200,"1-3/4\"\nFlanged","Flange",null,"SK375-0101",816,"17935-0001-P",21849,"SP1005-04","Assy 7257","SP1005-04","SP2700-51",null,"SP2700-49","SP2600-04","3577-0020","Assy 7257",9336,3574]
[4160,80,"0  32 Hose","Flange",null,null,null,"-P"]
[4360,200,"1-1/2\"\nFlanged","Flange",null,"SK230",816,"836-0001-P",21849,"SP1005-04",834,"SP1005-04","SP2704-01","SP2600-20","SP2704-02","SP2600-20",4367,2574,9336,4364]
[4410,40,"1/2\" BSP","Flange",null,"SK242",4908,"4568-0001-P","SP2701-01","SP6060-02",6396,"SP1003-01",null,null,null,null,4417,5097,4905,4414]
[4760,20,"3/4\" BSP","Flange",null,"SK228","2995-0030","673-0001-P","SP2701-04","SP1002-01",4454,"SP1002-09",null,null,null,null,4766,4466,3992,4764]
[4780,10,"3/4\" BSP","Flange",null,"SK217",1126,"4528-0001-P","SP2701-09","SP1002-01","AL8-01","SP1002-01",null,null,null,null,"Assy 4787",null,"AL6-200",4784]
[4850,80,"0  32 Hose","Flange",9750,null,3101,"920-08-P","SP2700-06","SP1003-09",5418,"SP1003-09","SP2700-07","SP2601-19",null,"SP2601-04",4857,5419,4855,4854]
[4860,80,"0 32 Hose","Flange",9760,null,3101,"920-08-P","SP2700-06","SP1003-09",5418,"SP1003-09","SP2700-07","SP2600-07",null,"SP2600-01",4867,5419,4855,4854]
[5460,20,"3/8\" BSP","Flange",null,null,5466,"673-0001-P","SP2701-04","SP1011-01","2907-0001","SP1002-01",null,null,null,null,5467,null,5465,5464]
[5640,20,null,null,null,"SK228","2995-0030","673-0001-P","SP2701-04","SP1003-01",4454,"SP1002-01",null,null,null,null,5647,4466,null,5644]
[5870,5,"1/2\" BSP","Flange",null,null,5878,"12104-0001-P","SP2701-09","SP1002-09",5868,"SP1002-01","SP2701-09",null,null,null,5877,5876,5875,5874]
[6330,80,"0 32 Hose/ Flange","Flange",null,"SK237",890,"4325-0480-P","SP2701-06","SP1003-11",4329,"SP1004-09","SP2701-06","SP2600-13","SP2701-06","SP2600-13",4337,"3196-01 ext",6335,6334]
[6710,20,"3/4\" BSP","Flange",null,"SK241","2995-0030","673-0001-P","SP2701-04","SP1002-09",4454,"SP1002-02",null,null,null,null,6717,4466,3992,"4764-41"]
[9360,10,"1/4\" BSP","Foot",null,"SK223",1126,"4528-0001-P","AL22","SP8019-01","ALS-01","SP1002-02",null,null,null,null,"AL10",null,"AL6-200","AL4-200"]
[9380,40,"3/4\" BSP","Flange",null,"SK33",3298,"1210-0001-P","SP2701-21","SP1002-02",3269,"SP1003-01","SP2701-21","SP2600-13",null,"SP2600-13",5857,3266,3991,"3374-200"]
[9400,20,"0  16 Hose","Flange",null,"SK211",10817,"673-0001-P","SP2701-04","SP1002-09","2907-0001","SP1002-09",null,null,null,null,9407,null,9406,9404]
[9430,10,"1/4\" BSP","Flange","Exhaust Cooling","SK221",1126,"4528-0001-P","SP2701-09","SP1002-01","ALS","SP1002-09",null,null,"SP2701-09",null,9436,null,"AL6-200",4784]
[9560,10,"3/8\" BSP","Flange",null,"SK23",1189,"4528-0001-P","SP2701-14","SP1002-01",2763,"SP1002-03",null,null,null,null,"Contact Manufacturer",2765,9566,9564]
[9700,80,"1\" Flanged","Flange",null,"SK238",890,"17937-0001-P","22645-0000","SP1003-01",3255,"SP1004-11","SP2700-48",null,null,"SP2600-06",9707,4156,3993,9704]
[9710,80,"1\" NPT","Foot","9710-200","SK229",890,"17937-0001-P","22617-0010","SP1003-09","934-0000","SP1004-09","SP2701-21","SP2600-38","SP2700-47","SP2600-38",9717,4156,3993,10329]
[9730,80,"0  32 Hose","Flange",null,"SK269","890-01","17937-0001-P","22626-0000","SP1003-09",890,"SP1004-09","SP2700-07","SP2600-01",null,"SP2600-01",9737,4156,3993,9734]
[9750,80,"0 32 Hose","Flange",null,"SK269","3101-01","17937-0001-P","22626-0000","SP1003-09",3255,"SP1004-11","SP2700-07","SP2600-01",null,"SP2600-01",9757,4156,3993,9754]
[9760,80,"0  32 Hose","Flange",null,"SK269","890-01","17937-0001-P","22626-0000","SP1003-09","934-0000","SP1004-11","SP2700-07","SP2600-01","SP2700-07","SP2600-01",9767,4156,3993,9754]
[9900,20,"0  16 Hose","Foot","29470-\n2231C","SK211",10817,"673-0001-P","SP2701-04","SP1002-09",10818,"SP1002-02",null,null,null,null,9907,null,9905,9904]
[10490,270,"2\" Flanged","Foot","52270-\n0011","SK254",816,"21676-0001-P",21849,"SP1005-04",6988,"SP1005-04","SP2701-54","SP2601-37","SP2700-49","SP2601-37","11254-01",2574,9936,10494]
[10590,270,"2\" Flanged","Flange","10590-22","SK254",816,"21676-0001-P",21849,"SP1005-04",6988,"SP1005-04","SP2701-54","SP2601-37",null,"SP2601-41","11258-01",2574,9336,10494]
[10630,200,"1-1/2\"\nFlanged","Foot","52220-\n0011","SK230",816,"836-0001-P",21849,"SP1005-04",834,"SP1005-04","SP2701-54","SP2601-37","SP2700-49","SP2601-37",11254,2574,9336,10634]
[10650,200,"1-1/2\"\nFlanged","Foot","51220-\n0011","SK230",816,"836-0001-P",21849,"SP1005-04",834,"SP1005-04","SP2701-54","SP2601-37",null,"SP2601-37","10657-0020",2574,9336,10634]
[10660,270,"2\" Flanged","Foot","51270-\n0011","SK254",816,"17936-0001-P",21849,"SP1005-04",6988,"SP1005-04","SP2701-54","SP2601-37",null,"SP2600-09","10657-0030",2574,9336,10494]
[10670,200,"1-1/2\"\nFlanged","Foot","50220-\n0011","SK230-01",816,"836-0001-P",21849,"SP1005-04",834,"SP1005-04","SP2701-54","SP2601-37",null,"SP2601-37","10667-0020",2574,9336,"10634-02"]
[10680,270,"2\" Flanged","Foot","50270-\n0011","SK254",816,"21676-0001-P",21849,"SP1005-04",6988,"SP1005-04","SP2701-54","SP2601-37",null,"SP2600-09","10667-0030",2574,9336,"10494-01"]
[10970,40,"3/4\" NPTF","Flange",null,"SK268-01",3298,"1210-0001-P","22617-0010","SP1002-02",490,"SP1003-01","SP2701-21","SP2601-39",null,"SP2601-39","9977-01",7883,3992,10974]
[11000,20,"0  16 Hose","Flange",null,"SK211",10817,"673-0001-P","SP2701-04","SP1002-09",2441,"SP1002-01",null,null,null,null,11007,null,9905,9904]
[11600,80,"1\" NPT","Foot",null,"SK299",890,"17937-0001-P","22617-0010","SP1003-09","934-0000","SP1004-09","SP2701-0940",null,"SP2700-48","SP2601-42",11608,4156,3993,11604]
[11790,200,"1-1/2\"\nFlanged","Flange",null,"SK230",816,"836-0001-P",21849,"SP1005-04",834,"SP1005-04",null,"SP2601-37","SP2701-54","SP2601-41","11796-0010",2574,9336,10584]
[14620,80,"1\" Hose","Flange",null,"SK153",890,"4598-0001-P","SP6080-08","SP1014-03",7867,"SP1003-01","SP2700-48","SP2600-25",null,null,14627,7868,14625,14622]
[21100,80,"1\" BSP","Foot",null,"SK288",890,"17937-0001-P","22626-0000","SP1003-09",21167,"SP1004-09","SP2701-21","SP2601-10",null,"SP2601-10","11127-02",21168,3993,"10329-02"]
[21180,200,"1-1/4\"\nFlanged","Flange",null,"SK293-01",816,"836-0001-P",21849,"SP1005-04",834,"SP1005-04","SP2701-51","SP2601-30",null,"SP2601-30",21186,2574,9336,21183]
[21690,40,"0 20 Hose","Flange",null,"SK239",3298,"1210-0001-P","22626-0000","SP1002-02",490,"SP1003-01","SP2701-21","SP2601-44",null,"SP2601-44",21698,7883,3992,21699]
[21770,40,"0 32 Hose","Flange",null,"SK309",4908,"4568-0001-P","SP2701-01","SP1003-09",490,"SP1003-07",null,null,"SP2701-01",null,21777,7883,21775,21774]
[21780,200,"1-1/4\" BSP","Foot",null,"SK230",816,"836-0001-P",21849,"SP1005-04",21789,"SP1004-09","SP2700-50",null,"SP2700-49","SP2600-04",21788,4156,3993,21784]
[21810,200,"1-1/4\" BSP","Foot",null,"SK310",890,"17018-0001-P","22617-0000","SP1003-09",834,"SP1005-04","SP2700-50","SP2600-18",null,null,21238,2574,9336,"10584-11"]
[21890,120,"1-1/2\" BSP","Flange","10880-\n2611","SK310",890,"17018-0001-P","22617-0000","SP1003-09",2551,"SP1005-05",null,null,null,null,null,2574,3993,"10329-200"]
[21980,200,"1-1/4\" BSP","Foot",null,"SK317",816,"836-0001-P",21849,"SP1005-04",834,"SP1005-04","SP2701-86","SP2601-37",null,"SP2601-37",21997,2574,9336,10634]
[21990,270,"2\" Flanged","Foot",null,"SK254",816,"21676-0001-P",21849,"SP1005-04",6988,"SP1005-04","SP2701-86","SP2601-37",null,"SP2601-37","21997-01",2574,9336,10494]
[22240,20,"0  16 Hose","Flange","Salt Water","SK333",9408,"673-0001-P","SP2701-09","SP1107-05",22217,"SP1002-01",null,null,null,null,null,null,null,"11474-01"]
[22240,20,"0  16 Hose","Flange","Fresh Water","SK333",9408,"673-0001-P","SP2701-09","SP1107-05",10818,"SP1002-02",null,null,null,null,22247,null,"11478(DivPI)",22374]
[22360,20,"0  16 Hose","N/A","Salt Water","SK337",10817,"673-0001-P","SP2701-04","X3075-062G",10818,"SP1002-01",null,null,null,null,null,null,22366,22364]
[22360,20,"0  16 Hose","Flange","Fresh Water","SK337",10817,"673-0001-P","SP2701-04","X3075-062G",22217,"SP1002-02","SP2701-04",null,"SP2701-04",null,22247,null,"11478(DivPI)",22374]
[22620,20,"0  25 Hose","Crank","29440-\n1101","SK346","1985-01","673-0001-P","SP6080-08","SP1004-09","2907-0001","SP1002-01",null,null,null,"SP2600-09",22627,null,9328,22624]
[22770,20,"0  25 Hose","Crank","29440-\n1001","SK346","1985-01","673-0001-P","SP2701-21","SP1004-09","2907-0001","SP1002-01",null,null,null,"SP2600-09",22627,null,9328,22624]
[29500,40,"0 28 Hose","Flange",null,"SK384-0001",3298,"1210-0001-P","SP2700-1027","SP1002-02",490,"SP1003-01","SP2700-1027","SP2601-0451",null,"SP2601-0451","29508-0000",7883,3992,"29504-1000"]
["10170-0011",40,"1\" Hose","Flange",null,"90133-0001","10183-0000","1210-0001-P","96080-0080","91003-0020","490-0000","91003-0070","92700-0480","92600-0060","92701-0160",null,null,"Obsolete","Obsolete","Obsolete"]
["10170-0011",80,"1-1/4\"\nHose",null,null,null,"10184-0000","11979-0001-P",null,null,"10182-0000","91004-0090"]
["10190-0011",40,"1\" Hose",null,null,null,null,"3085-0001-P"]
["10490-0201",270,"2\" Flanged","Foot","50270-\n0911","SK254",816,"21676-0001-P",21849,"SP1005-04",6988,"SP1005-04","SP2701-54","SP2601-37","SP2700-49","SP2601-37","11254-01",2574,9936,"10494-03"]
["10490-07",270,"2\" Flanged","Foot","52270-\n0011","SK254",816,"21676-0001-P",21849,"SP1005-04",6988,"SP1005-04","SP2701-54","SP2601-37","SP2700-49","SP2601-37","11254-01",2574,9936,10494]
["10490-207",270,"2\" Flanged","Foot","52270-\n0011","SK254",816,"21676-0001-P",21849,"SP1005-04",6988,"SP1005-04","SP2701-54","SP2601-37","SP2700-49","SP2601-37","11254-01",2574,9936,10494]
["10550-01",40,"3/4\" NPT","Foot",null,"SK239",3298,"1210-0001-P","22626-0000","SP1002-02",10336,"SP1003-09","SP2701-21","SP2601-39","SP2701-15","SP2601-39",10417,7883,3992,10554]
["10550-200",40,"3/4\" BSP","Foot",null,"SK239",3298,"1210-0001-P","22626-0000","SP1002-02",490,"SP1003-01","SP2701-21","SP2601-39","SP2701-15","SP2601-39",10417,7883,3992,10554]
["10550-205",40,"3/4\" BSP","Foot",null,"SK239",3298,"1210-0001-P","22626-0000","SP1002-02",10336,"SP1003-09","SP2701-21","SP2601-39","SP2701-15","SP2601-39",10417,7883,3992,10554]
["10550-2103",40,"3/4\" BSP","Foot",null,"SK239-0003",3298,"1210-0003-P","22626-0000","X3001-095F",490,"SP1003-01","SP2701-21","SP2601-39","SP2701-15","SP2601-39","10417-2100","22906-0000","22907-0000","10554-2100"]
["10550-2701",40,"3/4\" BSP","Foot",null,"SK239",3298,"1210-0001-P","22626-0000","SP1002-02",490,"SP1003-01","SP2701-21","SP2601-39","SP2701-15","SP2601-39",10417,7883,3992,10974]
["10590-0031",270,"2\" Flanged","Flange","10590-\n0111","SK254",816,"21676-0001-P",21849,"SP1005-04",22039,"SP1005-05","SP2701-54","SP2601-37",null,"SP2601-37","11256-01",2574,9336,10494]
["10590-0041",270,"2\" Flanged","Flange","10590-\n0111","SK254",816,"21676-0001-P",21849,"SP1005-04",22268,"SP1005-05","SP2701-54","SP2601-37",null,"SP2601-37","11258-01",2574,9336,10494]
["10590-01",270,"2\" Flanged","Flange","11101-01-\n01","SK254",816,"21676-0001-P",21849,"SP1005-04",6988,"SP1003-09","SP2701-21","SP2601-39","SP2701-15","SP2601-39",10417,7883,3992,10494]
["10590-0111",270,"2\" Flanged","Flange",null,"SK254",816,"17936-0001-P",21849,"SP1095- 0640",6988,"SP1005-04","SP2701-54","SP2601- 0458",null,"SP2601- 0458","11256-01",2574,9336,10494]
["10590-0141",270,"2\" Flanged","Flange","10590-\n0041","SK254",816,"21676-0001-P",21849,"SP1005-04",22268,"SP1005-05","SP2701-54","SP2601-37",null,"SP2601-37","11258-01",2574,9336,10494]
["10590-0201",270,"2\" Flanged","Flange","10590-\n0111","SK254",816,"21676-0001-P",21849,"SP1005-04",6988,"SP1005-04","SP2701-54","SP2601-37","SP2700-49","SP2601-37","11256-01",2574,9336,10494]
["10590-0231",270,"2\" Flanged","Flange",null,"SK254",816,"17936-0001-P",21849,"SP1095- 0640",22039,"SP1005-04","SP2701-54","SP2601-37",null,"SP2601-37","11256-01",2574,10773,10494]
["10590-0341",270,"2\" Flanged","Flange",null,"SK254",816,"17936-0001-P",21849,"SP1095- 0640",6988,"SP1005-04","SP2701-54","SP2601-37",null,"SP2601-37","11256-01",2574,10773,10494]
["10590-21",270,"2\" Flanged","Flange","10590-22","SK254",816,"21676-0001-P",21849,"SP1005-04",6988,"SP1005-04","SP2701-54","SP2601-37",null,"SP2601-41","11258-01",2574,9336,10494]
["10590-22",270,"2\" Flanged","Flange","10590-\n0111","SK254",816,"21676-0001-P",21849,"SP1005-04",6988,"SP1005-04","SP2701-54","SP2601-37",null,"SP2601-41","11258-01",2574,9336,10494]
["10590-61",270,"2\" Flanged","Flange","10590-62","SK254",816,"21676-0001-P",21849,"SP1005-04",6988,"SP1005-04","SP2701-54","SP2601-37",null,"SP2601-41","11258-01",2574,9336,10494]
["10590-62",270,"2\" Flanged","Flange",null,"SK254",816,"21676-0001-P",21849,"SP1005-04",6988,"SP1005-04","SP2701-54","SP2601-37",null,"SP2601-41","11258-01",2574,9336,10494]
["10590-63",270,"2\" Flanged","Flange",null,"SK254",816,"21676-0001-P",21849,"SP1005-04",6988,"SP1005-04","SP2701-54","SP2601-37",null,"SP2601-43","11258-01",2574,9336,10494]
["10630-01",200,"1-1/2\"\nFlanged","Foot","52220-\n0011","SK230",816,"836-0001-P",21849,"SP1005-04",834,"SP1005-04","SP2701-54","SP2601-37","SP2700-49","SP2601-37","11228-9000",2574,9336,10634]
["10630-07",200,"1-1/2\"\nFlanged","Foot","52220-\n0011","SK230",816,"836-0001-P",21849,"SP1005-04",834,"SP1005-04","SP2701-54","SP2601-37","SP2700-49","SP2601-37",11254,2574,9336,10634]
["10630-200",200,"1-1/2\"\nFlanged","Foot","52220-\n0011","SK230",816,"836-0001-P",21849,"SP1005-04",834,"SP1005-04","SP2701-54","SP2601-37","SP2700-49","SP2601-37",11254,2574,9336,10634]
["10630-207",200,"1-1/2\"\nFlanged","Foot","52220-\n0011","SK230",816,"836-0001-P",21849,"SP1005-04",834,"SP1005-04","SP2701-54","SP2601-37","SP2700-49","SP2601-37",11254,2574,9336,10634]
["10630-57",200,"1-1/2\"\nFlanged","Flange","52220-\n0011","SK230",816,"836-0001-P",21849,"SP1005-04",2551,"SP1005-05","SP2701-54","SP2601-37","SP2700-49","SP2601-37",11254,2574,9336,10634]
["10650-200",200,"1-1/2\"\nFlanged","Foot","51200-\n2011","SK230",816,"836-0001-P",21849,"SP1005-04",834,"SP1005-04","SP2701-54","SP2601-37",null,"SP2601-37","10657-0020",2574,9336,10634]
["10660-200",270,"2\" Flanged","Foot","51270-\n2011","SK254",816,"17936-0001-P",21849,"SP1005-04",6988,"SP1005-04","SP2701-54","SP2601-37",null,"SP2600-09","10657-0030",2574,9336,10494]
["10670-01",200,"1-1/2\"\nFlanged","Foot","50220-\n0111","SK230-01",816,"836-0001-P",21849,"SP1005-04",834,"SP1005-04","SP2701-54","SP2601-37",null,"SP2601-37","10667-0020",2574,9336,"10634-02"]
["10670-10",200,"1-1/2\"\nFlanged","Foot","50220-\n0211","SK230-01",816,"836-0001-P",21849,"SP1005-04",834,"SP1005-04","SP2701-54","SP2601-37",null,"SP2601-37","10667-0020",2574,9336,"10634-02"]
["10670-11",200,"1-1/2\"\nFlanged","Foot","50220-\n0311","SK230-01",816,"836-0001-P",21849,"SP1005-04",834,"SP1005-04","SP2701-54","SP2601-37",null,"SP2601-37","10667-0020",2574,9336,"10634-02"]
["10670-200",200,"1-1/2\"\nFlanged","Foot","50200-\n2011","SK230-01",816,"836-0001-P",21849,"SP1005-04",834,"SP1005-04","SP2701-54","SP2601-37",null,"SP2601-37","10667-0020",2574,9336,"10634-02"]
["10670-201",200,"1-1/2\"\nFlanged","Foot","50200-\n2111","SK230-01",816,"836-0001-P",21849,"SP1005-04",834,"SP1005-04","SP2701-54","SP2601-37",null,"SP2601-37","10667-0020",2574,9336,"10634-02"]
["10670-210",200,"1-1/2\"\nFlanged","Foot","50200-\n2211","SK230-01",816,"836-0001-P",21849,"SP1005-04",834,"SP1005-04","SP2701-54","SP2601-37",null,"SP2601-37","10667-0020",2574,9336,"10634-02"]
["10670-211",200,"1-1/2\"\nFlanged","Foot","50200-\n2311","SK230-01",816,"836-0001-P",21849,"SP1005-04",834,"SP1005-04","SP2701-54","SP2601-37",null,"SP2601-37","10667-0020",2574,9336,"10494-01"]
["10680-01",270,"2\" Flanged","Foot","50270-\n0111","SK254",816,"21676-0001-P",21849,"SP1005-04",6988,"SP1005-04","SP2701-54","SP2601-37",null,"SP2600-09","10667-0030",2574,9336,"10494-01"]
["10680-10",270,"2\" Flanged","Foot","50270-\n0211","SK254",816,"21676-0001-P",21849,"SP1005-04",6988,"SP1005-04","SP2701-54","SP2601-37",null,"SP2600-09","10667-0030",2574,9336,"10494-01"]
["10680-11",270,"2\" Flanged","Foot","50270-\n0311","SK254",816,"21676-0001-P",21849,"SP1005-04",6988,"SP1005-04","SP2701-54","SP2601-37",null,"SP2600-09","10667-0030",2574,9336,"10494-01"]
["10680-200",270,"2\" Flanged","Foot","50270-\n2011","SK254",816,"21676-0001-P",21849,"SP1005-04",6988,"SP1005-04","SP2701-54","SP2601-37",null,"SP2600-09","10667-0030",2574,9336,"10494-01"]
["10680-201",270,"2\" Flanged","Foot","50270-\n2111","SK254",816,"21676-0001-P",21849,"SP1005-04",6988,"SP1005-04","SP2701-54","SP2601-37",null,"SP2600-09","10667-0030",2574,9336,"10494-01"]
["10680-210",270,"2\" Flanged","Foot","50270-\n2211","SK254",816,"21676-0001-P",21849,"SP1005-04",6988,"SP1005-04","SP2701-54","SP2601-37",null,"SP2600-09","10667-0030",2574,9336,"10494-01"]
["10680-211",270,"2\" Flanged","Foot","50270-\n2311","SK254",816,"21676-0001-P",21849,"SP1005-04",6988,"SP1005-04","SP2701-54","SP2601-37",null,"SP2600-09","10667-0030",2574,9336,"10494-01"]
["10770-0051",200,"1-1/2\"\nFlanged","Flange",null,"SK369-0001",816,"836-0001-P",21849,"SP1095- 0640",2551,"SP1005-05","SP2701-54","SP2601-37",null,"SP2601-37",11258,2574,9336,10634]
["10770-0111",200,"1-1/2\"\nFlanged","Flange",null,"SK230",816,"17935-0001-P",21849,"SP1095- 0640",834,"SP1005-04","SP2701-54","SP2601-37",null,"SP2601-37",11256,2574,9336,10634]
["10770-0151",200,"1-1/2\"\nFlanged","Flange",null,"SK369-0001",816,"836-0001-P",21849,"SP1095- 0640",2551,"SP1005-05","SP2701-54","SP2601-37",null,"SP2601-37",11256,2574,9336,"23704-0000"]
["10770-0331",200,"1-1/2\"\nFlanged","Flange",null,"SK369-0001",816,"836-0001-P",21849,"SP1095- 0640","29772-0000","SP1005-05","SP2701-54","SP2601- 0458",null,"SP2601- 0458",11256,2574,9336,"10584-03"]
["10770-0351",200,"1-1/2\"\nFlanged","Flange",null,"SK230-01",816,"836-0001-P",21849,"SP1005-04",2551,"SP1005-05","SP2701-54","SP2601-37",null,"SP2601-37",11258,2574,9336,"23704-0000"]
["10770-0531",200,"1-1/2\"\nFlanged","Flange",null,null,816,"836-0001-P","96080-0373","SP1095- 0640","29772-0000","SP1005-05","SP2701-54","SP2601-37",null,"SP2601-37",11256,2574,9336,"23704-0000"]
["10770-0551",200,"1-1/2\"\nFlanged","Flange",null,null,816,"836-0001-P","96080-0373","SP1095- 0640",2551,"SP1005-05","SP2701-54","SP2601-37",null,"SP2601-37",11256,2574,10773,10634]
["10770-07",200,"1-1/2\"\nFlanged","Flange",null,"SK230-01",816,"836-0001-P",21849,"SP1005-04",834,"SP1005-04","SP2701-54","SP2601-37",null,"SP2601-41",11256,2574,9336,10634]
["10770-57",200,"1-1/2\"\nFlanged","Flange",null,"SK230-01",816,"836-0001-P",21849,"SP1005-04",2551,"SP1005-05","SP2701-54","SP2601-37",null,"SP2601-41",11256,2574,9336,10634]
["10770-62",200,"1-1/2\"\nFlanged","Flange",null,"SK230-01",816,"836-0001-P",21849,"SP1005-04",2551,"SP1005-05","SP2701-54","SP2601-37",null,"SP2601-41","21679-0000",2574,9336,10634]
["10800-21",200,"1\" NPSF","Flange",null,"SK229",890,"17937-0001-P","22617-0010","SP1003-09",3255,"SP1004-11","92701-6004","SP2601-10",null,"SP2601-10","10807-21",4156,3993,10634]
["10880-0051",200,"1-1/2\"\nFlanged","Flange",null,"SK230-0161",816,"17935-0001-P",21849,"SP1095- 0640",2551,"SP1005-05","SP2701-54","SP2601- 0458",null,"SP2601- 0458",11258,2574,9336,"10584-03"]
["10880-0101",200,"1-1/2\"\nFlanged","Flange",null,"SK230",816,"836-0001-P",21849,"SP1005-04",834,"SP1005-04","SP2701-54","SP2601-37",null,"SP2601-37",11258,2574,9336,"10584-03"]
["10880-0151",200,"1-1/2\"\nFlanged","Flange",null,"SK230-0161",816,"17935-0001-P",21849,"SP1095- 0640",2551,"SP1005-05","SP2701-54","SP2601- 0458",null,"SP2601- 0458",11256,2574,9336,"10584-03"]
["10880-07",200,"1-1/2\"\nFlanged","Flange",null,"SK230",816,"836-0001-P",21849,"SP1005-04",834,"SP1005-04","SP2701-54","SP2601-37",null,"SP2601-41",11258,2574,9336,10584]
["10880-21",200,"1-1/2\"\nFlanged","Flange",null,"SK230",816,"836-0001-P",21849,"SP1005-04",834,"SP1005-04","SP2701-54","SP2601-37",null,"SP2601-41","11228-9000",2574,9336,"21684-2000"]
["10880-2461",200,"1-1/2\"\nFlanged","Flange","10880-\n2561","SK375-0101",816,"17935-0001-P",21849,"SP1005-04",2551,"SP1005-05","SP2701-54","SP2601-37",null,"SP2601-37","11258-0020",2574,9336,"21684-2000"]
["10880-2561",200,"1-1/2\"\nFlanged","Flange",null,"SK375-0101",816,"17935-0001-P",21849,"SP1005-04",2551,"SP1005-05","SP2701-54","SP2601-37",null,"SP2601-41","23387-0000",2574,9336,"21684-2000"]
["10880-2611",200,"1-1/2\"\nFlanged","Flange",null,"SK375-0101",816,"17935-0001-P",21849,"SP1005-04",834,"SP1005-04","SP2701-54","SP2601-37",null,"SP2601-37","23387-0020",2574,9336,"21684-2000"]
["10880-2661",200,"1-1/2\"\nFlanged","Flange",null,"SK375-0101",816,"17935-0001-P",21849,"SP1005-04",2551,"SP1005-05","SP2701-54","SP2601-37",null,"SP2601-37","23387-0000",2574,9336,"21684-2000"]
["10880-62",200,"1-1/2\"\nFlanged","Flange",null,"SK230-01",816,"836-0001-P",21849,"SP1005-04",834,"SP1005-04","SP2701-54","SP2601-37",null,"SP2601-41","21679-0000",2574,9336,10584]
["10950-200",40,"3/4\" BSP","Flange","10950-\n2401","SK239",3298,"1210-0001-P","22617-0010","SP1002-02",490,"SP1003-01","SP2701-21","SP2601-39",null,"SP2601-39","23377-0000",7883,3992,"10554-200"]
["10950-201",40,"1/2\" BSP","Flange","10950-\n2401","SK239",3298,"1210-0001-P","22617-0010","SP1002-02",490,"SP1003-01","SP2701-21","SP2601-39",null,"SP2601-39","23377-0000",7883,3992,"10554-200"]
["10950-204",40,"3/4\" BSP","Flange","10950-\n2401","SK239",3298,"1210-0001-P","22617-0010","SP1002-02",10336,"SP1003-09","SP2701-21","SP2601-39",null,"SP2601-39","23377-0000",7883,3992,"10554-200"]
["10950-205",40,"3/4\" BSP","Flange","10950-\n2401","SK239",3298,"1210-0001-P","22617-0010","SP1002-02",10336,"SP1003-09","SP2701-21","SP2601-39",null,"SP2601-39","23377-0000",7883,3992,"10554-200"]
["10950-2101",40,"3/4\" BSP","Flange","10950-\n2401","SK239",3298,"1210-0001-P","22617-0010","SP1002-02",490,"SP1003-01","SP2701-21","SP2601-39",null,"SP2601-39","22927-0000",7883,3992,"10554-200"]
["10950-2141",40,"3/4\" BSP","Flange","10950-\n2401","SK239",3298,"1210-0001-P","22617-0010","SP1002-02",490,"SP1003-01","SP2701-21","SP2600-01",null,"SP2600-01","22927-0000",7883,3992,"10554-200"]
["10950-2201",40,"3/4\" BSP","Flange","10950-\n2601","SK239",3298,"1210-0001-P","22617-0010","SP1002-02",490,"SP1003-01","SP2701-21","SP2601-39",null,"SP2601-39","22927-0000",7883,3992,"10554-200"]
["10950-2241",40,"3/4\" BSP","Flange","10950-\n2601","SK239",3298,"1210-0001-P","22617-0010","SP1002-02",490,"SP1003-01","SP2701-21","SP2600-01",null,"SP2600-01","22927-0000",7883,3992,"10554-200"]
["10950-2401",40,"3/4\" BSP","Flange",null,"SK239",3298,"1210-0001-P","22617-0010","SP1002-02",490,"SP1003-01","SP2701-21","SP2600-01",null,"SP2600-01","23377-0000",7883,3992,"10554-200"]
["10950-2441",40,"3/4\" BSP","Flange","10950-\n2601","SK239",3298,"1210-0001-P","22617-0010","SP1002-02",10336,"SP1003-09","SP2701-21","SP2600-01",null,"SP2600-01","23377-0000",7883,3992,"10554-200"]
["10950-2451",40,"3/4\" BSP","Flange","10950-\n2601","SK239",3298,"1210-0001-P","22617-0010","SP1002-02",10336,"SP1003- 09684","SP2701-21","SP2600-01",null,"SP2600-01","23377-0000",7883,3992,"10554-200"]
["10950-2601",40,"3/4\" BSP","Flange",null,"SK239",3298,"1210-0001-P","22617-0010","SP1002-02",490,"SP1003-09","SP2701-21","SP2600-01",null,"SP2600-01","23377-0000",7883,3992,"10554-200"]
["10950-2701",40,"3/4\" BSP","Flange","10950-\n2401","SK239",3298,"1210-0001-P","22617-0010","SP1002-02",490,"SP1003-09","SP2701-21","SP2600-01",null,"SP2600-01","23377-0000",7883,3992,"10554-200"]
["10970-21",40,"3/4\"\nFlanged","Flange",null,"SK268-01",3298,"1210-0001-P","22617-0010","SP1002-02",490,"SP1003-01","SP2701-21","SP2601-39",null,"SP2601-39","9977-01",7883,3992,21148]
["10980-0051",200,"1-1/2\"\nFlanged","Flange",null,"SK230-0161",816,"17935-0001-P",21849,"SP1005-04",2551,"SP1005-05","SP2700-51",null,null,"SP2600-04","4388-07",2574,9336,10634]
["10980-01",200,"1-1/2\"\nFlanged","Flange","10980-\n0051","SK230-01",816,"836-0001-P",21849,"SP1005-04",2551,"SP1005-05","SP2701-51",null,null,"SP2600-04","4388-07",2574,9336,"10634-01"]
["11000-01",20,"0  16 Hose","Flange",null,"SK211",10817,"673-0001-P","SP2701-04","SP1002-09",2907,"SP1002-09",null,null,null,null,11007,null,9905,9904]
["11100-0101",270,"2\" Flanged","Flange",null,"SK254",816,"21676-0001-P",21849,"SP1005-04",6988,"SP1005-54","SP2701-54","SP2601-37",null,"SP2601-37","11494-01",2574,9336,"11104-01"]
["11100-01-01",270,"2\" BSP","Flange",null,"SK254",816,"21676-0001-P",21849,"SP1005-04",6988,"SP1005-54","SP2701-54","SP2601-37",null,"SP2601-37","11494-01",2574,9336,"11104-01"]
["11100-0141",270,"2\" Flanged","Flange",null,"SK254",816,"21676-0001-P",21849,"SP1005-04",6988,"SP1005-54","SP2701-54","SP2601-37",null,"SP2601-37","11494-01",2574,9336,"11104-01"]
["11100-0151",270,"2\" Flanged","Flange",null,"SK254",816,"21676-0001-P",21849,"SP1005-04",22268,"SP1005-05","SP2701-54","SP2601-37",null,"SP2601-37","11494-01",2574,9336,"11104-01"]
["11100-0541",270,"2\" Flanged","Flange",null,"SK254",816,"21676-0001-P",21849,"SP1005-04",22268,"SP1005-05","SP2701-54","SP2601- 0458",null,"SP2601- 0458","23387-0010",2574,9336,"11104-0050"]
["11100-0601",270,"2\" Flanged","Flange",null,"SK254",816,"17936-0001-P",21849,"SP1005-04",6988,"SP1005-04","SP2701-54","SP2601- 0458",null,"SP2601- 0458","23387-0010",2574,9336,"11104-0050"]
["11100-0641",270,"2\" Flanged","Flange",null,"SK254",816,"17936-0001-P",21849,"SP1005-04",22268,null,"SP2701-54","SP2601- 0458",null,"SP2601- 0458","23387-0010",2574,9336,"11104-0050"]
["11120-200",80,"1\" BSP","Flange",null,"SK229",890,"17937-0001-P","22617-0010","SP1003-09","934-0000","SP1004-09","SP2701-21","SP2601-10",null,"SP2601-10",11127,4156,3993,"10329-200"]
["11120-204",80,"1\" BSP","Flange",null,"SK229",890,"17937-0001-P","22617-0010","SP1003-09",3255,"SP1004-11","SP2701-21","SP2601-10",null,"SP2601-10",11127,4156,3993,"10329-200"]
["11120-205",80,"1\" BSP","Flange",null,"SK229",890,"17937-0001-P","22617-0010","SP1003-09",2431,"SP1004-10","SP2701-21","SP2601-10",null,"SP2601-10",11127,4156,3993,"10329-200"]
["11150-0011",200,"2\" Flanged","Foot",null,"SK254",816,"21676-0001-P",21849,"SP1005-04",6988,"SP1005-04","SP2701-54","SP2601-37",null,"SP2601-37","11254-01",2574,9336,11104]
["11260-200",10,"1/4\" BSP","Flange","29300-\n2101C","SK266",1126,"4528-0001-P","SP2701-04","SP1002-01","ALB","SP1002-09",null,null,null,null,11227,null,"AL6-200","11264-200"]
["11260-205",10,"1/4\" BSP","Flange","29300-\n2151C","SK266",1126,"4528-0001-P","SP2701-04","SP1002-01","ALB-01","SP1002-01",null,null,null,null,11227,null,"AL6-200","11264-200"]
["11260-2101",10,"3/8\" BSP","Flange","29300-\n2201C","SK266",1126,"4528-0001-P","SP2701-04","SP1002-01","ALB","SP1002-09",null,null,null,null,11227,null,"AL6-200","11264-2100"]
["11260-211",10,"1/4\" BSP","Flange",null,"SK266",1126,"4528-0001-P","SP2701-04","SP1002-01","ALB","SP1002-09",null,null,null,null,21537,null,"AL6-200","11264-200"]
["11260-2151",10,"3/8\" BSP","Flange","29300-\n2151C","SK266",1126,"4528-0001-P","SP2701-04","SP1002-01","ALB-01","SP1002-01",null,null,null,null,11127,null,"AL6-200","11264-2100"]
["11260-2211",10,"3/8\" BSP","Flange",null,"SK266",1126,"4528-0001-P","SP2701-04","SP1002-01","ALB","SP1002-09",null,null,null,null,21537,null,"AL6-200","11264-200"]
["11410-200",40,"3/4\" BSP","Foot","Bilge","SK328",11415,"1210-0001-P","22617-0010","SP1003-08",7876,"SP1003-01",null,null,null,null,null,null,null,"11414-200"]
["11410-200",80,"1\" BSP","Foot","Cooling","SK328",890,"17937-0001-P","22617-0010","SP1003-11","934-0000","SP1004-09","SP2701-21","SP2600-38","SP2700-47","SP2600-38","9717-21",7883,"11416(Div Pl)","10339-221"]
["11430-01",10,"1/4\" BSP","Flange",null,"SK272",11438,"4528-0001-P","SP2700-11","SP1002-04",11436,"SP1002-01","SP2701-22",null,null,"SP2600-07",11437,2765,11435,"11434-01"]
["11470-200",20,"0  16 Hose","Flange","Bilge","SK325",11475,"673-0001-P","22626-0000","SP1002-03","2907-0001","SP1002-09",null,null,null,null,null,null,null,11474]
["11470-200",40,"3/4\" BSP","Flange","Cooling","SK325",11476,"1210-0001-P","22626-0000","SP1002-06",490,"SP1003-01","SP2701-21","SP2600-13",null,"SP2600-13",11447,7883,"11478 (Div Pl)","10974-221"]
["11570-200",20,"0  16 Hose","Flange","Bilge","SK325",11475,"673-0001-P","22626-0000","SP1002-03","2907-0001","SP1002-09",null,null,null,null,null,null,null,11474]
["11570-200",40,"3/4\" BSP","Flange","Cooling","SK325",11476,"1210-0001-P","22626-0000","SP1002-06",490,"SP1003-01","SP2703-02","SP2601-39","SP2701-15","SP2601-39",11577,7883,"11478 (Div Pl)","10554-221"]
["11590-204",40,"3/4\" BSP","Foot","Bilge","SK285",11415,"1210-0001-P","22645-0000","SP1003-08",7876,"SP1003-01",null,null,null,null,null,null,null,"11414-200"]
["11590-204",80,"1\" BSP","Foot","Cooling","SK285",11593,"17937-0001-P","22645-0000","SP1003-11",3255,"SP1004-11","SP2700-48",null,null,"SP2600-06","9707-21",4156,"11416(Div Pl)","9704-21"]
["11620-200",10,"1/4\" BSP","Flange","22830-\n2101","SK23",1189,"4528-0001-P","SP2701-11","SP1002-01",2763,"SP1002-03","SP2700-63",null,null,"SP2600-08","1053-11",2765,9566,"11624-200"]
["11620-211",10,"1/4\" BSP","Flange",null,"SK23",1189,"4528-0001-P","SP2701-11","SP1002-01",2763,"SP1002-03","SP2700-63",null,null,"SP2600-08","1053-11",2765,9566,"11624-200"]
["11650-200",10,"3/8\" BSP","Flange",null,"SK266",1126,"4528-0001-P","SP2701-04","SP1002-01","ALB","SP1002-09",null,null,null,null,11653,null,"AL6-200","11654-200"]
["11740-200",40,"3/4\" BSP","Foot","Bilge","SK300",11746,"17937-0001-P",21849,"SP1005-03","934-0000","SP1004-09",null,null,null,null,null,null,null,10634]
["11740-200",80,"1\" Flanged","Foot","Cooling","SK300",816,"836-0001-P",21849,"SP1005-03",834,"SP1005-04","SP2701-54","SP2601-37","SP2700-49","SP2601-37","11749-0000",2574,"11745 (Div Pl)","11744-200"]
["11740-205",80,"1\" BSP","Foot","Bilge","SK300",11746,"17937-0001-P",21849,"SP1005-03","934-0000","SP1004-09",null,null,null,null,null,null,null,10634]
["11740-205",200,"1-1/2\"\nFlanged","Foot","Cooling","SK300",816,"836-0001-P",21849,"SP1005-03",2551,"SP1005-05","SP2701-54","SP2601-37","SP2700-49","SP2601-37","11749-0000",2574,"11745 (Div Pl)","11744-200"]
["11790-01",200,"1-1/2\"\nFlanged","Flange",null,"SK230",816,"836-0001-P",21849,"SP1005-04",834,"SP1005-04",null,"SP2601-37","SP2701-54","SP2601-41",11258,2574,9336,10584]
["11850-0101",40,"1\" Hose","Flange","11850-\n0701","SK117-02",8641,"1210-0001-P","SP6080-08","SP1026-01",8528,"SP1030- 0100","SP3000- 0090","SP2600- 0070",null,null,"11977-0010",8493,9176,"11854-0410"]
["11850-0701",40,"1\" Hose","Flange",null,"SK117-02",8641,"1210-0001-P","SP6080-08","SP1026-01",8528,"SP1030- 0100","SP3000- 0090","SP2600- 0070",null,null,"11977-0010",8493,9176,"11854-0410"]
["11850-0701",40,"1\" Hose","Flange",null,"90117-0001","8641-0000","1210-0001-P","96080-0080","91026-0010","8528-0000","91030-0110","93000-0090","92600-0070",null,null,"11977-0000","8493-0000","12346-0000","11854-0410"]
["11850-0711",40,"1\" Hose","Foot",null,"90117-0001","8641-0000","1210-0001-P","96080-0080","91026-0010","8528-0000","91030-0110","93000-0090","92600-0070",null,null,"11977-0000","8493-0000","12346-0000","11854-0410"]
["11860-0001",80,"1\" NPT","Foot",null,"90118-0001","890-0000","920-0003-P","96080-0080","91003-0010","934-0000","91004-0090","913-0000","92600-0540",null,null,"11867-0000","4156-0000","11831-0000","11864-0000"]
["11860-0003",80,"1\" NPT","Foot",null,"90118-0003","890-0000","920-0003-P","96080-0080","91003-0010","934-0000","91004-0090","913-0000","92600-0540",null,null,"11867-0000","4156-0000","11831-0000","11864-0000"]
["11860-0004",80,"1\" NPT","Foot",null,"90118-0003","890-0000","920-0003-P","96080-0080","91003-0010","934-0000","91004-0090","913-0000","92600-0540",null,null,"11867-0000","4156-0000","11831-0000","11864-0000"]
["11860-0005",80,"1\" NPT","Foot",null,"90118-0003","890-0000","920-0003-P","96080-0080","91003-0010","934-0000","91004-0090","913-0000","92600-0540",null,null,"11867-0000","4156-0000","11831-0000","11864-0000"]
["11860-0006",80,"1\" NPT","Foot",null,"90118-0003","890-0000","920-0003-P","96080-0080","91003-0010","934-0000","91004-0090","913-0000","92600-0540",null,null,"11867-0000","4156-0000","11831-0000","11864-0000"]
["11860-0007",80,"1\" NPT","Foot",null,"90118-0003","890-0000","920-0003-P","96080-0080","91003-0010","934-0000","91004-0090","913-0000","92600-0540",null,null,"11867-0000","4156-0000","11831-0000","11864-0000"]
["11870-0001",200,"1-1/4\" NPT","Foot",null,"90062-0003","816-0000","836-0003-P","6407-0010","91005-0040","834-0001","91004-0040","817-0000","92600-0040",null,null,"11877-0000","2574-0000","12062-0000","18753-0585"]
["11870-0003",200,"1-1/4\" NPT","Foot",null,"90062-0003","816-0000","836-0003-P","6407-0010","91005-0040","834-0001","91004-0040","817-0000","92600-0040",null,null,"11877-0000","2574-0000","12062-0000","18753-0585"]
["11870-0004",200,"1-1/4\" NPT","Foot",null,"90062-0003","816-0000","836-0003-P","6407-0010","91005-0040","834-0001","91004-0040","817-0000","92600-0040",null,null,"11877-0000","2574-0000","12062-0000","18753-0585"]
["11870-0005",200,"1-1/4\" NPT","Foot",null,"90062-0003","816-0000","836-0003-P","6407-0010","91005-0040","834-0001","91004-0040","817-0000","92600-0040",null,null,"11877-0000","2574-0000","12062-0000","18753-0585"]
["11870-0006",200,"1-1/4\" NPT","Foot",null,"90062-0003","816-0000","836-0003-P","6407-0010","91005-0040","834-0001","91004-0040","817-0000","92600-0040",null,null,"11877-0000","2574-0000","12062-0000","18753-0585"]
["11870-0007",200,"1-1/4\" NPT","Foot",null,"90062-0003","816-0000","836-0003-P","6407-0010","91005-0040","834-0001","91004-0040","817-0000","92600-0040",null,null,"11877-0000","2574-0000","12062-0000","18753-0585"]
["12050-0001",80,"3/4\" Hose","Flange",null,"90117-0121","8641-0080","3085-0001-P","92700-0180","91003-0090","8528-0000","91003-0110","92700-0060","92600-0070",null,null,"12057-0000","8493-0000","12055-0000","12054-0000"]
["12280-0001",80,"0  32 Hose","Flange",null,"90155-0001","12288-0000","17937-0001-P","96080-0080","91003-0010",null,null,"913-0000","92600-0060",null,null,"12287-0000",null,"12294-0000","12284-0000"]
["12600-0001",200,"3\" Hose","Flange",null,null,"12608-0000","17935-0001-P","6408-0000","91005-0040","12176-0000",null,"817-0000","92600-0040",null,null,"12607-0000","12606-0000","12179-0000","12604-0000"]
["12600-0011",200,"3\" Hose","Flange",null,null,"12608-0000","17935-0001-P","6408-0000","91005-0040","12176-0000",null,"817-0000","92600-0040",null,null,"12607-0000","12606-0000","12179-0000","12604-0000"]
["12600-0021",200,"3\" Hose","Flange",null,null,"12608-0000","17935-0001-P","6408-0000","91005-0040","12176-0000",null,"817-0000","92600-0040",null,null,"12607-0000","12606-0000","12179-0000","12604-0000"]
["14210-0001",40,"3/4\" Hose","Flange",null,"90111-0001","3298-0000","1210-0001-P","96080-0080","91002-0020","6148-0040","91003-0070","913-0000","92600-0060",null,null,"14217-0000","7038-0000","11830-0000","14214-0000"]
["14300-0001",200,"1-1/2\"\nFlanged","Foot",null,null,"816-0000","17935-0001-P","6408-0000","91005-0040","834-0001","91005-0040","92701-0180","92600-0260",null,"92600-0260","14307-0000","2574-0000","12062-0000","10584-0010"]
["14320-0001",40,null,null,null,null,"10183-0000","1210-0001-P","96080-0080","91003-0010","490-0000","91003-0070",null,"92600-0460",null,"92600-0460","Obsolete",null,"Obsolete","Obsolete"]
["14420-0001",80,"1\" NPT",null,null,"90118-0001","890-0000","17937-0001-P","96080-0080","91003-0010","934-0000","91003-0010","913-0000","92600-0540","914-0000",null,"6718-0000","4156-0000","11831-0000","798-0020"]
["14440-0001",200,"2\" Flanged","Flange",null,null,"816-0000","17935-0001-P","6408-0000","91095-0060","834-0001","91005-0040","92701-0060","92600-0260",null,"92600-0260","Proprietary","2574-0000","12062-0000","Proprietary"]
["1673-0001",40,"1/2\" NPT","Foot",null,"90015-0001","1835-0000","1210-0001-P","92700-0060","91003-0010","490-0001","91003-0010","1554-0000","92600-0330",null,null,"1737-0410",null,"11836-0000","9094-0000"]
["1673-0003",40,"1/2\" NPT","Foot",null,"90015-0003","1835-0000","1210-0003-P","92700-0060","91003-0010","490-0001","91003-0010","1554-0000","92600-0330",null,null,"1737-0410",null,"11836-0000","9094-0000"]
["1673-1001",40,"1/2\" NPT","Foot",null,"90015-0001","18753-0133","1210-0001-P","92700-0060","91003-0010","490-0000","91003-0010",null,"18753-0130",null,"18753-0130","18753-0129",null,"11836-0000","18753-0128"]
["1673-1003",40,"1/2\" NPT","Foot",null,"90015-0003","18753-0133","1210-0003-P","92700-0060","91003-0010","490-0000","91003-0010",null,"18753-0130",null,"18753-0130","18753-0129",null,"11836-0000","18753-0128"]
["1673-2001",40,"1/2\" NPT","Foot",null,"90119-0001","18753-0133","1210-0001-P","96080-0080","91003-0010","490-0000","91003-0010",null,"18753-0130",null,"18753-0130","18753-0129",null,"11836-0000","18753-0128"]
["17030-0001",80,"3/4\"\nFlanged","Flange",null,null,"3101-0000","17937-0001-P","96080-0080","91003-0010","7867-0000","91003-0010","913-0000","92600-0060","818-0000",null,"Obsolete","7868-0000","11831-0000","Obsolete"]
["17040-0001",80,"3/4\"\nFlanged","Flange",null,null,"3101-0000","17937-0001-P","96080-0080","91003-0010","3255-0000","91004-0090","913-0000","92600-0060",null,null,"Proprietary","4156-0000","11831-0000","Proprietary"]
["17050-0001",80,"1-1/4\"\nFlanged","Flange",null,null,"3101-0000","17937-0001-P","96080-0080","91003-0010","7873-0000","91003-0020","913-0000","92600-0060",null,null,"7267-0000","7868-0000","11831-0000","17054-0000"]
["17050-0002",80,"1-1/4\"\nFlanged","Flange",null,null,"3101-0000","17937-0001-P","96080-0080","91003-0010","7873-0000","91003-0020","913-0000","92600-0060",null,null,"7267-0000","7868-0000","11831-0000","17054-0000"]
["17100-0001",80,"1-1/4\" NPT","Flange",null,"90179-0001","17106-0000","17937-0001-P","96080-0080","Obsolete",null,null,null,null,null,null,null,"17108-0000","17232-0000","Obsolete"]
["17100-0005",80,"1-1/4\" NPT","Flange",null,"90179-0001","17106-0000","17937-0001-P","96080-0080","Obsolete",null,null,null,null,null,null,null,"17108-0000","17232-0000","Obsolete"]
["17100-0011",80,"1-1/4\" NPT","Flange",null,"90179-0001","17106-0000","17937-0001-P","96080-0080","Obsolete",null,null,null,null,null,null,null,"17108-0000","17232-0000","Obsolete"]
["17120-0001",10,"3/8\" NPT","Flange",null,"90178-0001","9156-0010","4528-0001-P","92700-0060","91002-0090","4538-0000","91002-0090",null,null,null,null,"17127-0000",null,"11833-0000","17124-0000"]
["17200-0001",80,"1-1/4\"\nHose","Flange","18930-\n0010",null,"10184-0000","11979-0001-P","96080-0080","91003-0010","10182-0000","91004-0090",null,null,null,null,"14206-0000",null,"14937-0000","17204-0000"]
["17350-0011",120,null,"Flange",null,null,"17106-0001","17018-0001-P","96080-0080",null,null,null,null,null,null,null,null,"17108-0000","17232-0000"]
["17360-1001",200,"2-1/2\"\nFlange","Flange",null,"90190-0001","17365-1000","17370-0001-P","96080-0371","91005-0040","17374-1000",null,"92701-0180","18752-0000",null,"18752-0000","17366-1000","17372-1000","17378-1000"]
["17380-0001",80,null,null,null,null,"17106-0000","11979-0001-P","92700-0060",null,null,null,null,"92600-0460",null,"92600-0460","17388-0010","17108-0000","17232-0000","Obsolete"]
["17380-0011",80,null,null,null,null,"17106-0000","11979-0001-P","92700-0060",null,null,null,null,"92600-0460",null,"92600-0460","17388-0010","17108-0000","17232-0000","Obsolete"]
["17380-0021",80,null,null,null,null,"17106-0000","11979-0001-P","92700-0060",null,null,null,null,"92600-0460",null,"92600-0460","17388-0010","17108-0000","17232-0000","Obsolete"]
["17380-0031",80,null,null,null,null,"17106-0000","11979-0001-P","92700-0060",null,null,null,null,"92600-0460",null,"92600-0460","17388-0010","17108-0000","17232-0000","Obsolete"]
["17410-0001",40,"1\" Hose","Flange","18830-\n1020","90187-0012","17408-0000","3085-0001-P","96080-0080","91095-0540",null,null,null,null,null,null,"17388-0010","17847-0000","17232-0000","17404-0000"]
["17440-0001",80,null,null,null,"90181-0001","17445-0000","17937-0001-P","96080-0080","Obsolete","2431-0000","91004-0100",null,null,null,null,"Obsolete","17108-0010",null,"Obsolete"]
["17490-0001",270,null,null,null,null,"17365-1000","17936-0001-P","96080-0371","91005-0040","17374-1000",null,"92700-0180","18752-0000",null,"18752-0000","17366-1010","17372-1000","17378-1000"]
["17520-0001",200,"2-1/2\"\nFlange","Flange",null,null,"816-0000","17935-0001-P","6408-0000","18753-0332","834-0001","91005-0040","92700-0180","18753-0140",null,"18753-0140","Proprietary","2574-0000","12062-0000","Proprietary"]
["17520-0002",200,"2-1/2\"\nFlange","Flange",null,null,"816-0000","17935-0001-P","6408-0000","18753-0332","834-0001","91005-0040","92700-0180","18753-0140",null,"18753-0140","Proprietary","2574-0000","12062-0000","Proprietary"]
["17520-0051",200,"2-1/2\"\nFlange","Flange",null,null,"2553-1000","17935-0001-P","6408-0000","18753-0332","2551-0000","91005-0050","92700-0180","18753-0140",null,"18753-0140","Proprietary","2574-0000","12062-0000","Proprietary"]
["17520-0052",200,"2-1/2\"\nFlange","Flange",null,null,"2553-1000","17935-0001-P","6408-0000","18753-0332","2551-0000","91005-0050","92700-0180","18753-0140",null,"18753-0140","Proprietary","2574-0000","12062-0000","Proprietary"]
["17530-0000",370,"3\" Flange","Flange",null,null,"92000-1358","18786-0001-P","96080-0371","91106-0236","18785-0000",null,"92701-0180","92601-0471",null,"18753-0592","Proprietary","18787-0000","18784-1000","Proprietary"]
["17540-0001",370,null,null,null,null,"92000-1358","18786-0001-P","96080-0371","91106-0236","18785-0000",null,"92701-0180","92601-0471",null,null,"Proprietary","18787-0000","18784-1000","Proprietary"]
["17810-1000",200,"2-1/2\"\nFlange","Flange",null,"90019-1011","816-0000","17935-0001-P","6408-0000","91095-0060","834-0001","91005-6040","817-0000","92600-6260",null,null,"17807-0001","2574-0000","12062-0000","10584-0010"]
["17970-0000",200,"2-1/2\"\nFlange","Flange",null,null,"17365-1000","17370-0001-P","96080-0371",null,"17374-1000",null,"92701-0180","18752-0000",null,"18752-0000","Proprietary","17272-1000",null,"Proprietary"]
["18200-0000",200,"3\" Hose","Flange",null,null,"17365-1000","17370-0001-P","96080-0371","18753-0332","17374-1000",null,"817-0000","92600-0320",null,"92600-0320","18204-0000","17372-1000","17378-1000","18203-0000"]
["18200-0002",200,"3\" Hose","Flange",null,null,"17365-1000","17370-0001-P","96080-0371","18753-0332","17374-1000",null,"817-0000","92600-0320",null,"92600-0320","18204-0000","17372-1000","17378-1000","18203-0000"]
["18300-0000",270,"1-1/2\" NPT","Foot",null,"90254-0001","816-0000","17936-0001-P","6408-0000","91005-0040","6988-0000","91004-0040","92700-0180","92600-0260",null,"92600-0260","10657-0010","2574-0000","12062-0000","18313-0002"]
["18310-0000",270,"2\" NPT","Foot",null,"90254-0003","816-0000","6760-0003-P","6408-0000","91005-0040","6988-0000","91004-0040","92701-0180","92600-0260",null,"92600-0260","10657-0010","2574-0000","12062-0000","18313-0002"]
["18320-0000",270,"1-1/2\" NPT","Foot",null,"90254-0001","816-0000","17936-0001-P","6408-0000","91005-0040","6988-0000","91005-0040","92701-0180","92600-0260",null,"92600-0260","10677-0010","2574-0000","12062-0000","18313-0003"]
["18320-0001",270,"1-1/2\" NPT","Foot",null,"90254-0001","816-0000","17936-0001-P","6408-0000","91005-0040","6988-0000","91005-0040","92701-0180","92600-0260",null,"92600-0260","10677-0010","2574-0000","12062-0000","18313-0003"]
["18320-0002",270,"1-1/2\" NPT","Foot",null,"90254-0001","816-0000","17936-0001-P","6408-0000","91005-0040","6988-0000","91005-0040","92701-0180","92600-0260",null,"92600-0260","10677-0010","2574-0000","12062-0000","18313-0003"]
["18330-0000",270,"2\" NPT","Foot",null,"90254-0003","816-0000","6760-0003-P","6408-0000","91005-0040","6988-0000","91005-0040","92701-0180","92600-0260",null,"92600-0260","10677-0010","2574-0000","12062-0000","18313-0000"]
["18330-0001",270,"2\" NPT","Foot",null,"90254-0003","816-0000","6760-0003-P","6408-0000","91005-0040","6988-0000","91005-0040","92701-0180","92600-0260",null,"92600-0260","10677-0010","2574-0000","12062-0000","18313-0000"]
["18330-0002",270,"2\" NPT","Foot",null,"90254-0003","816-0000","6760-0003-P","6408-0000","91005-0040","6988-0000","91005-0040","92701-0180","92600-0260",null,"92600-0260","10677-0010","2574-0000","12062-0000","18313-0000"]
["18340-0000",270,"1-1/2\" NPT","Foot",null,"90254-0001","816-0000","17936-0001-P","6408-0000","91005-0040","6988-0000","91005-0040","92701-0180","92600-0260","818-0000","92600-0260","10487-0010","2574-0000","12062-0000","18313-0004"]
["18370-0000",270,"2\" NPT","Foot",null,"90254-0001","816-0000","17936-0001-P","6408-0000","91005-0040","6988-0000","91005-0040","92701-0180","92600-0260","818-0000","92600-0260","10487-0010","2574-0000","12062-0000","18313-0001"]
["18400-0050",40,"3/4\" NPT","Flange",null,"90033-0001","5212-0000","1210-0001-P","92700-0060","91002-0020","5211-0000","91003-0090","92700-0060","92600-0130",null,"92600-0130","18404-0000","5211-0000","11830-0000"]
["18760-0001",200,null,null,null,"90190-0001","17365-1000","17370-0001-P","96080-0371","91005-0040","17374-1000",null,"92700-0180","18752-0000",null,"18752-0000","17366-1000","17372-1000","17378-1000","Proprietary"]
["18760-0002",200,null,null,null,"90190-0001","17365-1000","17370-0001-P","96080-0371","91005-0040","17374-1000",null,"92700-0180","18752-0000",null,"18752-0000","17366-1000","17372-1000","17378-1000","Proprietary"]
["18760-0003",200,null,null,null,"90190-0001","17365-1000","17370-0001-P","96080-0371","91005-0040","17374-1000",null,"92700-0180","18752-0000",null,"18752-0000","17366-1000","17372-1000","17378-1000","Proprietary"]
["18760-0004",200,null,null,null,"90190-0001","17365-1000","17370-0001-P","96080-0371","91005-0040","17374-1000",null,"92700-0180","18752-0000",null,"18752-0000","17366-1000","17372-1000","17378-1000","Proprietary"]
["18760-0013",200,null,null,null,"90190-0001","17365-1000","17370-0001-P","96080-0371","91005-0040","17374-1000",null,"92700-0180","18752-0000",null,"18752-0000","17366-1000","17372-1000","17378-1000","Proprietary"]
["18760-3000",200,null,null,null,"90190-0001","17365-1000","17370-0001-P","96080-0371","91005-0040","17374-1000",null,"92700-0180","18752-0000",null,"18752-0000","17366-1000","17372-1000","17378-1000","Proprietary"]
["18770-0003",370,"2-1/2\"\nFlanged","Flange",null,null,"18753-0434","18789-0001-P","96080-0371","18753-0495","18785-0000",null,"92701-0180","18753-0527",null,"18753-0526","18753-0525","18787-0000","18784-1000","18773-0000"]
["18770-0004",370,"2-1/2\"\nFlanged","Flange",null,null,"18753-0434","18789-0001-P","96080-0371","18753-0495","18785-0000",null,"92701-0180","18753-0527",null,"18753-0526","18753-0525","18787-0000","18784-1000","18773-0000"]
["18770-0005",370,"2-1/2\"\nFlanged","Flange",null,null,"18753-0434","18789-0001-P","96080-0371","18753-0495","18785-0000",null,"92701-0180","18753-0527",null,"18753-0526","18753-0525","18787-0000","18784-1000","18773-0000"]
["18780-0000",370,"2\" Flanged","Flange",null,null,null,"-P"]
["18780-0001",370,"2\" Flanged","Flange",null,null,"18753-0434","18786-0001-P","96080-0371","18753-0495","18785-0000",null,"92701-0180","18752-0000",null,"18752-0000","Proprietary","18787-0000","18784-1000","Proprietary"]
["18780-0003",370,"2\" Flanged","Flange",null,null,"18753-0434","18786-0001-P","96080-0371","18753-0495","18785-0000",null,"92701-0180","18752-0000",null,"18752-0000","Proprietary","18787-0000","18784-1000","Proprietary"]
["18780-0013",370,"2\" Flanged","Flange",null,null,"18753-0434","18786-0001-P","96080-0371","18753-0495","18785-0000",null,"92701-0180","18752-0000",null,"18752-0000","Proprietary","18787-0000","18784-1000","Proprietary"]
["18790-0001",370,"2\" Flanged","Flange",null,null,"92000-1358","18786-0001-P","96080-0371","18753-0495","18785-0000",null,"92701-0180","18752-0000",null,"18752-0000","Proprietary","18787-0000","18784-1000","Proprietary"]
["18825-0010",80,"1-1/2\"\nHose","Flange",null,"90171-0001","18753-0005","17937-0001-P","96080-0080","18753-0001","18829-1000","91004-0090",null,"92600-0120",null,"92600-0120","18827-1000",null,null,"18826-1000"]
["18830-0000",40,"1\" Hose","Flange",null,"90180-0001","18753-0005","1210-0001-P","96080-0080","18753-0001","490-0001","91003-0010",null,"92600-0120",null,"92600-0120","18836-1000",null,null,"18834-1000"]
["18830-0010",40,"1\" Hose","Flange",null,"90180-0001","18753-0005","1210-0001-P","96080-0080","18753-0001","490-0001","91003-0010",null,"92600-0120",null,"92600-0120","18836-1000",null,null,"18834-1000"]
["18830-1020",40,"1\" Hose","Flange",null,null,"18753-0005","3085-0001-P","96080-0080","18753-0001","490-0001","91003-0010",null,"92600-0120",null,"92600-0120","18836-1000",null,null,"18834-1000"]
["18840-0010",40,"1\" Hose","Flange",null,"90180-0001","18753-0005","1210-0001-P","96080-0080","18753-0001","490-0001","91003-0010",null,"92600-0120",null,"92600-0120","18836-1000",null,null,"18834-1000"]
["18840-1010",40,"1\" Hose","Flange",null,null,"18753-0005","3085-0001-P","96080-0080","18753-0010","490-0001","91003-0010",null,"92600-0120",null,"92600-0120","18836-1000",null,null,"18834-1000"]
["18930-0000",80,"1-1/4\"\nHose","Flange",null,"90184-0001","18753-0005","11979-0001-P","96080-0080","18753-0001","10182-0000","91004-0090",null,"92600-0120",null,"92600-0120","18836-1000",null,null,"18944-1000"]
["18930-0010",80,"1-1/4\"\nHose","Flange",null,"90184-0001","18753-0005","11979-0001-P","96080-0080","18753-0001","10182-0000","91004-0090",null,"92600-0120",null,"92600-0120","18836-1000",null,null,"18944-1000"]
["18930-0020",80,"1-1/4\"\nHose","Flange",null,"90184-0001","18753-0005","11979-0001-P","96080-0080","18753-0001","10182-0000","91004-0090",null,"92600-0120",null,"92600-0120","18836-1000",null,null,"18944-1000"]
["18940-0010",80,"1-1/4\"\nHose","Flange",null,"90184-0001","18753-0005","11979-0001-P","96080-0080","18753-0010","10182-0000","91004-0090",null,"92600-0120",null,"92600-0120","18836-1000",null,null,"18944-1000"]
["21080-200",40,"1/2\" BSP","Foot","Bilge","SK330",11415,"1210-0001-P","SP2701-21","SP1003-11","Assy 7884","SP1003-01",null,null,null,null,null,"Assy 7884",null,"11414-200"]
["21080-200",80,"1\" Flanged","Foot","Cooling","SK330",890,"17937-0001-P","SP2701-21","SP1003-08","934-0000","SP1004-09","SP2700-48",null,"SP2700-47","SP2600-06",21087,4156,"11416(DivPI)","6424-221"]
["21080-204",40,"3/4\" BSP","Foot","Bilge","SK330",11415,"1210-0001-P","SP2701-21","SP1003-11","Assy 7884","SP1003-01",null,null,null,null,null,"Assy 7884",null,"11414-200"]
["21080-204",80,"1\" BSP","Foot","Cooling","SK330",890,"17937-0001-P","SP2701-21","SP1003-08",3225,"SP1004-10","SP2700-48",null,"SP2700-47","SP2600-06",21087,4156,"11416(DivPI)","6424-221"]
["21090-200",40,"3/4\" BSP","Flange","21090-204","SK239",3298,"1210-0001-P","22626-0000","SP1002-02",490,"SP1003-01",null,null,null,null,null,7883,3993,"10974-200"]
["21090-204",40,"3/4\" BSP","Flange",null,"SK230",816,"836-0001-P",21849,"SP1005-04",10336,"SP1003-09",null,null,null,null,21098,7883,3993,"10974-200"]
["21130-200",10,"3/8\" BSP","Flange","21130-\n2101","SK304",21117,"4528-0001-P","SP2701-04","SP1002-03","ALB","SP1002-02",null,null,null,null,null,null,null,"21113-200"]
["21130-200",10,"3/8\" BSP","Flange","21130-\n2101","SK304",21117,"4528-0001-P","SP2701-04","SP1002-17","ALB","SP1002-09",null,null,null,null,21133,null,"21116 (Div Pl)","11264-201"]
["21130-2101",10,"3/8\" BSP","Flange","Bilge","SK304",21117,"4528-0001-P","SP2701-04","SP1002-03","ALB","SP1002-02",null,null,null,null,null,null,null,"11264-2110"]
["21130-2101",10,"3/8\" BSP","Flange","Cooling","SK304",21117,"4528-0001-P","SP2701-04","SP1002-17","ALB","SP1002-01",null,null,null,null,21133,null,"21116 (Div Pl)","21113-200"]
["21140-200",80,"1\" BSP","Flange","21140-\n2401","SK229",890,"17937-0001-P","22617-0010","SP1003-09","934-0000","SP1004-09","SP2701-21","SP2601-39",null,null,"10957-01",4156,3993,"10329-200"]
["21140-201",80,"1\" BSP","Flange","21140-\n2401","SK229",890,"17937-0001-P","22617-0010","SP1003-09","934-0000","SP1004-09","SP2701-21","SP2601-39",null,null,"10957-01",4156,3993,"10329-200"]
["21140-204",80,"1\" BSP","Flange","21140-\n2401","SK229",890,"17937-0001-P","22617-0010","SP1003-09",3255,"SP1004-11","SP2701-21","SP2601-39",null,null,"10957-01",4156,3993,"10329-200"]
["21140-2101",80,"1\" BSP","Flange","21140-\n2601","SK229",890,"17937-0001-P","22617-0010","SP1003-09","934-0000","SP1004-09","SP2701-21","SP2601-39",null,null,"22927-0010",4156,3993,"10329-200"]
["21140-2141",80,"1\" BSP","Flange","21140-\n2601","SK229",890,"17937-0001-P","22617-0010","SP1003-09",3255,"SP1004-11","SP2701-21","SP2600-01",null,"SP2600-01","22927-0010",4156,3993,"10329-200"]
["21140-2201",80,"1\" BSP","Flange","21140-\n2601","SK229",890,"17937-0001-P","22617-0010","SP1003-09","934-0000","SP1004-09","SP2701-21","SP2601-01",null,null,"22927-0010",4156,3993,"10329-200"]
["21140-2241",80,"1\" BSP","Flange","21140-\n2601","SK229",890,"17937-0001-P","22617-0010","SP1003-09",3255,"SP1004-11","SP2701-21","SP2600-01",null,"SP2600-01","22927-0010",4156,3993,"10329-200"]
["21140-2308",80,"1\" BSP","Flange",null,"SK229-0008",890,"920-0008-P","22617-0010","SP1003-09","934-0000","SP1004-09","SP2701-21","SP2601-39",null,null,"10957-01",4156,3993,"10329-200"]
["21140-2401",80,"1\" BSP","Flange",null,"SK423-0001",890,"920-0001-P","22617-0010","SP1003-09","934-0000","SP1004-09","SP2701-21","SP2601-01",null,null,"23377-0010",4156,3993,"10329-200"]
["21140-2441",80,"1\" BSP","Flange",null,"SK229",890,"17937-0001-P","22617-0010","SP1003-09",3255,"SP1004-11","SP2701-21","SP2601-39",null,null,"23377-0010",4156,3993,"10329-200"]
["21140-2601",80,"1\" BSP","Flange",null,"SK423-0001",890,"920-0001-P","22617-0010","SP1003-09","934-0000","SP1004-09","SP2701-21","SP2601-01",null,null,"23377-0010",4156,3993,"10329-200"]
["21140-2641",80,"1\" BSP","Flange",null,"SK229",890,"17937-0001-P","22617-0010","SP1003-09",3255,"SP1004-11","SP2701-21","SP2601-01",null,null,"23377-0010",4156,3993,"10329-200"]
["21140-2701",80,"1\" BSP","Flange",null,"SK229",890,"17937-0001-P","22617-0010","SP1003-09","934-0000","SP1004-09","SP2701-21","SP2601-01",null,null,"23377-0010",4156,3993,"10329-200"]
["21180-05",200,"1-1/4\"\nFlanged","Flange",null,"SK293-01",816,"836-0001-P",21849,"SP1005-04",2551,"SP1005-05","SP2701-51","SP2601-30",null,"SP2601-30",21186,2574,9336,21183]
["21190-200",20,"3/8\" BSP","Foot","Bilge","SK327",11476,"673-0001-P","SP2701-21","SP1002-06",2907,"SP1002-09",null,null,null,null,null,null,null,11474]
["21190-200",40,"1/2\" BSP","Foot","Cooling","SK327",11475,"1210-0001-P","SP2701-21","SP1002-03","Assy 7884","SP1003-01","SP2701-21",null,null,"SP2600-07",21197,"Assy 7884","11748(DivPI)","3274-221"]
["21580-200",80,"1\" BSP","Flange",null,"SK229",890,"17937-0001-P","22626-0000","SP1003-09","934-0000","SP1004-09","SP2701-39","SP2601-39",null,"SP2601-39",21587,4156,3993,"10329-200"]
["21680-05",80,"1-1/4\" NPT","Foot",null,"SK315-0101",816,"17935-0001-P",21849,"SP1005-04",2551,"SP1005-05","SP2700-50",null,"SP2700-49","SP2600-04",9527,2574,9336,21684]
["21690-05",40,"0 20 Hose","Flange",null,"SK239",3298,"1210-0001-P","22626-0000","SP1002-02",10336,"SP1003-09","SP2701-21","SP2601-44",null,"SP2601-44",21698,7883,3992,21699]
["21690-200",40,"3/4\" BSP","Flange",null,"SK239",3298,"1210-0001-P","22626-0000","SP1002-02",490,"SP1003-01","SP2701-21","SP2601-44",null,"SP2601-44",21698,9496,"21695-200","16554-200"]
["21810-01",200,"1-1/4\" BSP","Foot",null,"SK230",816,"836-0001-P",21849,"SP1005-04",834,"SP1005-04","SP2700-50","SP2600-18",null,null,21238,2574,9336,"10584-11"]
["21820-200",40,"1/2\" BSP","Foot","52040-\n2001","SK33",3298,"1210-0001-P","SP2701-21","SP1002-02",490,"SP1003-01","SP2701-21",null,"SP2701-15","SP2600-07",21826,7883,3992,"21824-200"]
["21820-2001",40,"3/4\" BSP","Foot","52040-\n2001","SK33",3298,"1210-0001-P","SP2701-21","SP1002-02",490,"SP1003-01","SP2701-21",null,"SP2701-15","SP2600-07",21826,7883,3992,"21824-2100"]
["21820-2003",40,"3/4\" BSP","Foot","52040-\n2003","SK384-0003",3298,"1210-0003-P","SP2700-1027","SP1002-02",490,"SP1003-01",null,null,"SP2701-15","SP2600-07",21826,7883,3992,"21824-2100"]
["21820-2021",40,"3/4\" BSP","Foot","52040-\n2021","SK384-2021",3298,"3085-0001-P","SP2700-1027","SP1002-02",490,"SP1003-01",null,null,"SP2701-15","SP2600-07",21826,7883,3992,"21824-2100"]
["21820-205",40,"1/2\" BSP","Foot",null,"SK33",3298,"1210-0001-P","SP2701-21","SP1002-02",10336,"SP1003-09","SP2701-21",null,"SP2701-15","SP2600-07",21826,7883,"3992ab","21824-200"]
["21880-200",80,"1\" BSP","Foot","Bilge","SK300",11746,"17937-0001-P",21849,"SP1005-03","934-0000","SP1004-09",null,null,null,null,null,4156,null,"6404-200"]
["21880-200",200,"1-1/4\" BSP","Foot","Cooling","SK300",816,"836-0001-P",21849,"SP1005-03",834,"SP1005-04","SP2700-50",null,"SP2700-49","SP2700-04",21887,2574,"11745 (Div Pl)","6404-200"]
["21880-205",80,"1\" BSP","Foot","Bilge","SK300",11746,"17937-0001-P",21849,"SP1005-03",2551,"SP1005-05",null,null,null,null,null,2574,null,"11744-200"]
["21880-205",200,"1-1/4\" BSP","Foot","Cooling","SK300",816,"836-0001-P",21849,"SP1005-03","934-0000","SP1004-09","SP2700-50",null,"SP2700-49","SP2700-04",21887,4156,"11745 (Div Pl)","6404-200"]
["21960-200",80,"1\" BSP","Foot","50080-\n2001","SK229",890,"17937-0001-P","22617-0010","SP1003-09","934-0000","SP1004-09","SP2700-48","SP2601-42","SP2701-87",null,21966,4156,3933,"10329-200"]
["21960-210",80,"1\" BSP","Foot","50080-\n2101","SK229",890,"17937-0001-P","22617-0010","SP1003-09","934-0000","SP1004-09","SP2700-48","SP2601-42","SP2701-87",null,21966,4156,3933,"10329-200"]
["21960-211",80,"1\" BSP","Foot","50080-\n2201","SK229",890,"17937-0001-P","22617-0010","SP1003-09","934-0000","SP1004-09","SP2700-48","SP2601-42","SP2701-87",null,21966,4156,3933,"10329-200"]
["21960-221",80,"1\" BSP","Foot","50080-\n2301","SK229",890,"17937-0001-P","22617-0010","SP1003-09","934-0000","SP1004-09","SP2700-48","SP2601-42","SP2701-87",null,21966,4156,3933,"10329-200"]
["22040-01",270,"2\" Flanged","Flange",null,null,4009,"17936-0001-P",21849,"SP1005-04",6988,"SP1005-04","SP2700-50",null,null,"SP2600-32",null,2574,9336,"11104-02"]
["22040-0131",270,"2\" Flanged","Flange","22040-\n0501","SK318",816,"17936-0001-P",21849,"SP1005-04",22039,"SP1005-05","SP2700-50",null,null,"SP2600-32","21239-0010",2574,9336,"11104-03"]
["22040-0501",270,"2\" Flanged","Flange",null,"SK318",816,"17936-0001-P",21849,"SP1005-04",6988,"SP1005-04","SP2700-50",null,null,"SP2600-32","21239-0010",2574,9336,"11104-03"]
["22040-0531",270,"2\" Flanged","Flange",null,"SK318",816,"17936-0001-P",21849,"SP1005-04",22039,"SP1005-05","SP2700-50",null,null,"SP2600-32","21239-0010",2574,9336,"11104-03"]
["22110-0201",60,"1-1/4\"\nHose","Crank",null,null,"18753-0656","22120-0001-P","96080-0080","18753-0657"]
["22110-0251",60,"1-1/4\"\nHose","Crank",null,null,"18753-0656","22120-0001-P","96080-0080","18753-0657",null,null,null,null,null,null,null,null,null,"992ab"]
["22110-0301",60,"1-1/4\"\nHose","Crank",null,null,"18753-0656","22120-0001-P","96080-0080","18753-0657"]
["22110-0351",60,"1-1/4\"\nHose","Crank",null,null,"18753-0656","22120-0001-P","96080-0080","18753-0657"]
["22220-2001",60,"1\" BSP","Flange",null,"SK334",3298,"22120-0001-P","22626-0000","SP8019-01",22318,"SP1004-11","SP2701-21","SP2600-13",null,"SP2600-13","22227-0100",7883,3992,22224]
["22220-241",60,"1\" BSP","Flange",null,"SK334",3298,"22120-0001-P","22617-0010","SP1002-01",22318,"SP1004-11","SP2701-21","SP2600-13",null,"SP2600-13",22227,7883,3992,22224]
["22230-200",10,"1/4\" BSP","Flange","Salt Water","SK332",21117,"4528-0001-P","SP2701-09","SP1107-05",22216,"SP1002-02",null,null,null,null,null,null,null,"22234-200"]
["22230-200",10,"1/4\" BSP","Flange","Fresh Water","SK332",21117,"4528-0001-P","SP2701-09","SP1107-05","ALB","SP1002-09",null,null,null,null,22237,null,"21116 (Div Pl)","21913-202"]
["22300-05",60,"0 32 Hose","Crank","22740-\n0351","SK331-05",3298,"22120-0001-P","SP6080-08","SP8019-01",22308,"SP1004-10",null,"SP2600-09",null,null,22307,null,3992,22304]
["22350-200",10,"1/4\" BSP","Flange","Salt Water","SK336",1126,"4528-0001-P","SP2701-09","X3075-062G",22216,"SP1002-02",null,null,null,null,null,null,22357,"22234-200"]
["22350-200",10,"1/4\" BSP","Flange","Fresh Water","SK336",1126,"4528-0001-P","SP2701-09","X3075-062G","ALB","SP1002-09","SP2701-04",null,"SP2701-04",null,22237,null,"21116 (Div Pl)","22354-200"]
["22400-0201",60,null,null,null,null,"18753-0656","22120-0001-P",null,"18753-0657"]
["22400-0251",60,null,null,null,null,"18753-0656","22120-0001-P",null,"18753-0657"]
["22400-0301",60,null,null,null,null,null,"-P"]
["22410-204",80,"1\" BSP","Flange",null,"SK236",890,"17937-0001-P","SP2701-21","SP1003-09",3255,"SP1004-10","SP2700-48",null,"SP2700-47","SP2600-06","6718-202",null,3993,22414]
["22690-200",80,"1\" BSP","Foot","Salt Water","SK344",11746,"17937-0001-P",21849,"SP1005-03","934-0000","SP1004-09",null,null,null,null,null,4156,"11745 (Div Pl)",10494]
["22690-200",270,"2\" BSP","Foot","Fresh Water","SK344",816,"21676-0001-P",21849,"SP1005-03",6988,"SP1005-04","SP2701-54","SP2601-37","SP2700-49","SP2601-37","11749-01",2574,null,"11744-200"]
["22740-0151",60,"0  32 Hose","Crank",null,"SK331-05",3298,"22120-0001-P","SP6080-08","SP8019-01",22308,"SP1004-10",null,null,null,"SP2600-09",22307,null,3992,"22304-01"]
["22740-0201",60,"0  32 Hose","Crank",null,"SK331-0251",3298,"22120-0001-P","SP2701-21","SP8019-01",22318,"SP1004-11",null,null,null,"SP2600-09",22307,null,3992,"22304-01"]
["22740-0251",60,"0  32 Hose","Crank","22740-\n0151","SK331-0251",3298,"22120-0001-P","SP2701-21","SP8019-01",22308,"SP1004-10",null,null,null,"SP2600-09",22307,null,3992,"22304-01"]
["22740-0301",60,"1\" Flanged","Crank","22740-\n0201","SK331-05",3298,"22120-0001-P","SP2701-21","SP8019-01",22318,"SP1004-11",null,null,null,"SP2600-09",22307,null,3992,"22304-01"]
["22740-0351",60,"0  32 Hose","Crank",null,"SK331-05",3298,"22120-0001-P","SP2701-21","SP8019-01",22308,"SP1004-10",null,null,null,"SP2600-09",22307,null,3992,"22304-01"]
["22740-0451",60,"0  32 Hose","Crank",null,null,3298,"22120-0001-P","SP2701-21","SP1002-01",22308,"SP1004-10",null,null,null,"SP2600-09","22307-0100",null,3992,"22304-01"]
["22750-05",60,"0  32 Hose","Crank","22750-\n1101","SK331-05",3298,"22120-0001-P","SP2701-21","SP8019-01",22308,"SP1004-10",null,null,null,"SP2600-09",22627,null,3992,"22304-02"]
["22750-1101",60,"0  32 Hose","Crank",null,"SK331-05",3298,"22120-0001-P","SP2701-21","SP8019-01",22318,"SP1004-11",null,null,null,"SP2600-09",22627,null,3992,"22304-02"]
["22750-1151",60,"0  32 Hose","Crank",null,"SK331-05",3298,"22120-0001-P","SP2701-21","SP8019-01",22308,"SP1004-10",null,null,null,"SP2600-09",22627,null,3992,"22304-02"]
["22770-1051",60,"0  25 Hose","Crank","29440-\n1051","SK346","1985-01","673-0001-P","SP2701-21","SP1004-09",2441,"SP1002-0152",null,null,null,"SP2600-09",22627,null,9328,22624]
["22770-1101",20,"0  25 Hose","Crank","29440-\n1101","SK346","1985-01","673-0001-P","SP2701-21","SP1004-09","2907-0001","SP1002-01",null,null,null,"SP2600-09",22627,null,9328,22624]
["22790-1001",40,"3/8\" BSP","Flange","Salt Water","SK350","X4020-254A","22799-0001-P","SP2701-04","X3075-061G","2907-0001","SP1002-09",null,null,null,null,null,null,null,23393]
["22790-1001",40,"3/8\" BSP","Flange","Fresh Water","SK350",22798,"22799-0001-P","SP2701-04","X3075-061G","22789-0000","SP1002-09",null,null,null,null,"22797-01",null,22366,23393]
["22820-2051",10,"3/8\" BSP","Flange",null,"SK23",1189,"4528-0001-P","SP2701-1462","SP1002-01",21233,"SP1002-03","SP2701-14","Y5052-43",null,"Y5052-43",22827,2765,9566,"22824-200"]
["22820-2101",10,"3/8\" BSP","Flange",null,"SK23",1189,"4528-0001-P","SP2701-14","SP1002-01",2763,"SP1002-03","SP2701-14","Y5052-43",null,"Y5052-43",22827,2765,9566,"22824-200"]
["22830-2001",10,"3/8\" BSP","Flange",null,"SK23",1189,"4528-0001-P","SP2701-14","SP1002-01",2763,"SP1002-03","SP2700-11","Y5052-43",null,"Y5052-43","22837-0000",2765,9566,"22834-200"]
["22830-2051",10,"3/8\" BSP","Flange",null,"SK23",1189,"4528-0001-P","SP2701-14","SP1002-01",21233,"SP1002- 0234","SP2701-14","Y5052-43",null,"Y5052-43",22827,2765,9566,"22834-200"]
["22830-2101",10,"3/8\" BSP","Flange",null,"SK23",1189,"4528-0001-P","SP2701-14","SP1002-01",2763,"SP1002-03","SP2701-14","Y5052-43",null,"Y5052-43","22757-0000",2765,9566,"22834-200"]
["22830-2151",10,"3/8\" BSP","Flange",null,"SK23",1189,"4528-0001-P","SP2701-14","SP1002-01",21233,"SP1002- 0234","SP2701-14","Y5052-43",null,"Y5052-43","22757-0000",2765,9566,"22834-200"]
["22830-2201",10,"3/8\" BSP","Flange",null,"SK23",1189,"4528-0001-P","SP2701-14","SP1002-01",2763,"SP1002-03","SP2701-14","Y5052-43",null,"Y5052-43","22757-0000",2765,9566,"22834-2100"]
["22830-2301",10,"3/8\" BSP","Flange",null,"SK23",1189,"4528-0001-P","SP2701-14","SP1002-01",2763,"SP1002-03","SP2701-14","Y5052-43",null,"Y5052-43","22757-0100",2765,9566,"22834-2200"]
["22940-2001",10,"3/8\" BSP","Foot","52010-\n2001","SK23",1189,"4528-0001-P","SP2701-14","SP1002-01",2763,"SP1002-03","SP2701-14","Y5052-43","Y5016-09","Y5052-43","22947-0000",2765,9566,"22944-2000"]
["22940-2051",10,"3/8\" BSP","Foot",null,"SK23",1189,"4528-0001-P","SP2701-14","SP1002-01",21233,"SP1002- 0234","SP2701-14","Y5052-43","Y5016-09","Y5052-43","22947-0000",2765,9566,"22944-2000"]
["22940-2053",10,"3/8\" BSP","Foot",null,"SK23-37",1189,"4528-0003-P","SP2701-14","SP1002-01",21233,"SP1002- 0234","SP2701-14","Y5052-43","Y5016-09","Y5052-43","22947-0000",2765,9566,"22944-2000"]
["22950-2031",20,"3/8\" BSP","Foot","52020-\n2001","SK20","2995-0030","673-0001-P","SP2700-05","SP1002-02",10818,"SP1002-09","SP2700-05","SP2601-39","SP2701-15","SP2601-39",22957,22806,3992,"22954-2000"]
["22950-2037",20,"3/8\" BSP","Foot","52020-\n2001","SK20","2995-0030","673-0003-P","SP2700-05","SP1002-02",10818,"SP1002-09","SP2700-05","SP2601-39","SP2701-15","SP2601-39",22957,22806,3992,"22954-2000"]
["22960-1001",10,"019   Hose","Foot",null,"SK355",21646,"4528-0001-P","SP2701-14","SP1002-09","ALB","SP1002-02",null,null,null,"SP2600- 0025","22967-0000",null,21645,"22964-1000"]
["22960-2001",10,"019   Hose","Foot",null,"SK355",21646,"4528-0001-P","SP2701-14","SP1002-09","ALB","SP1002-02",null,null,null,"SP2600- 0025","22967-0000",null,21645,"22964-1000"]
["2300-9001",80,"1\" NPT","Foot",null,"90118-0001","890-0000","17937-0001-P","96080-0080","91003-0010","934-0000","91004-0090","913-1000","92600-0060",null,null,"6718-0001","4156-0000","11831-0000","798-0030"]
["2300-9003",80,"1\" NPT","Foot",null,"90118-0003","890-0000","920-0003-P","96080-0080","91003-0010","934-0000","91004-0090","913-0000","92600-0060",null,null,"6718-0001","4156-0000","11831-0000","798-0030"]
["2300-9004",80,"1\" NPT","Foot",null,"90118-0001","890-0000","17937-0001-P","96080-0080","91003-0010","934-0000","91004-0090","913-0000","92600-0060",null,null,"6718-0001","4156-0000","11831-0000","798-0030"]
["2300-9005",80,"1\" NPT","Foot",null,"90118-0003","890-0000","920-0003-P","96080-0080","91003-0010","934-0000","91004-0090","913-0000","92600-0060",null,null,"6718-0001","4156-0000","11831-0000","798-0030"]
["23010-0131",80,"1\" BSP","Flange","Bilge","SK357-0001",11746,"920-0001-P",21849,"SP1005-03","934-0000","SP1004-09",null,null,null,null,null,2574,null,"11104-03"]
["23010-0131",270,"2\" Flange","Flange","Cooling","SK357-0001",816,"17936-0001-P",21849,"SP1005-03",22039,"SP1005-05","SP2700-51",null,null,"SP2600-32","23017-0000",4156,"11745 (Div Pl)","11744-200"]
["23010-0501",80,"1\" BSP","Flange","Bilge",null,null,"-P"]
["23010-0501",270,"2\" Flange","Flange","Cooling",null,null,"-P"]
["23010-0531",80,"1\" BSP","Flange","Bilge","SK357-0001",11746,"17937-0001-P",21849,"SP1005-03",834,"SP1004-09",null,null,null,null,null,2574,null,"1104-03"]
["23010-0531",270,"2\" Flange","Flange","Cooling","SK357-0001",816,"17936-0001-P",21849,"SP1005-03",22039,"SP1005-05","SP2700-50",null,null,"SP2600-32","23017-0010",4156,"11745 (Div Pl)","11744-200"]
["23020-1101",60,"0 32 Hose","Crank",null,"SK331-05",3298,"22120-0001-P","SP6080-08","SP8019-01",22318,"SP1004-11",null,null,null,"SP2600-09",22307,null,3992,"22304-02"]
["23050-1031",20,"3/8\" BSP","Flange",null,"SK211",10817,"673-0001-P","SP2701-04","SP1002-09",10818,"SP1002-02",null,null,null,null,"23057-0000",null,9905,11004]
["23060-1101",20,"0  16 Hose","Crank","Bilge","SK360",3298,"673-0001-P","SP6080-08","SP1002-03","2907-0001","SP1002-09",null,null,null,null,null,null,null,11474]
["23060-1101",60,"0  32 Hose","Crank","Cooling","SK360",9408,"22120-0001-P","SP6080-08","SP1002-06",22318,"SP1004-11",null,"SP2600-09",null,null,"23067-0000",null,"11478(DivPI)","22304-0030"]
["23070-1151",60,"0 32 Hose","Crank",null,"SK331-05",3298,"22120-0001-P","SP6080-08","SP8019-01",22308,"SP1004-10",null,"SP2600-09",null,null,22307,null,3992,"22304-0020"]
["23080-1151",60,"0  32 Hose","Flange",null,"SK363-0051",3298,"22120-0001-P","22617-0010","SP1002-01",22308,"SP1004-10","SP2701-03","SP2600-12",null,"SP2600-12","23087-0000",7883,3992,"23082-8000"]
["23320-2001",80,"1-1/2\"\nFlanged","Flange",null,"SK229",890,"17937-0001-P","22617-0010","SP1003-09","934-0000","SP1004-09","SP2701-21","SP2601- 0448",null,"SP2601- 0448","23327-9000",4156,3993,"11604-2000"]
["23320-2101",80,"1-1/2\"\nFlanged","Flange","New Pipework","SK229",890,"17937-0001-P","22617-0010","SP1003-09","934-0000","SP1004-09","SP2701-21","SP2601- 0448",null,"SP2601- 0448","23328-9000",4156,3993,"11604-2000"]
["23340-1001",120,"0  45 Hose","Flange",null,"SK310",890,"17018-0001-P","22617-0010","SP1003-09","23341-0000","SP1004-09","SP2701-54","SP2601-41",null,"SP2601-41","23347-0000",4156,3993,"23344-8000"]
["23340-1101",120,"0  45 Hose","Flange","Respecified","SK310",890,"17018-0001-P","22617-0010","SP1003-09","23341-0000","SP1004-09","SP2701-54","SP2601-41",null,"SP2601-41","23348-0000",4156,3993,"23344-8000"]
["23430-1001",80,"0  32 Hose","Flange",null,"SK385-0001",890,"17937-0001-P","SP2700-1027","SP1003-0111","934-0000","SP1004-09","SP2700-1027","SP2600-01",null,"SP2600-01","23437-0000",4256,3993,"23434-1000"]
["23430-1031",80,"0 32 Hose","Flange",null,"SK385-0001",890,"17937-0001-P","SP2700-1027","SP1003-0111","23436-0000","SP1004-09","SP2700-1027","SP2600-01",null,"SP2600-01","23437-0000",4256,3993,"23434-1000"]
["23430-1041",80,"0  32 Hose","Flange",null,"SK385-0001",890,"17937-0001-P","SP2700-1027","SP1003-0111",3255,"SP1004-11","SP2700-1027","SP2600-01",null,"SP2600-01","23437-0000",4256,3993,"23434-1000"]
["23430-1051",80,"0 32 Hose","Flange",null,"SK385-0001",890,"17937-0001-P","SP2700-1027","SP1003-0111",2431,"SP1004-10","SP2700-1027","SP2600-12",null,"SP2600-12","23437-0000",4156,3993,"23434-1000"]
["23430-1201",80,"0  32 Hose","Flange",null,"SK385-0001",890,"17937-0001-P","SP2700-1027","SP1003-0111","934-0000","SP1004-09","SP2700-1027","SP2600-12",null,"SP2600-12","23477-0000",4156,3993,"23434-1000"]
["23430-1241",80,"0 32 Hose","Flange",null,"SK385-0001",890,"17937-0001-P","SP2700-1027","SP1003-0111",3255,"SP1004-11","SP2700-1027","SP2600-12",null,"SP2600-12","23477-0000",4156,3993,"23434-1000"]
["23430-1251",80,"0  32 Hose","Flange",null,"SK385-0001",890,"17937-0001-P","SP2700-1027","SP1003-0111",2431,"SP1004-10","SP2700-1027","SP2600-12",null,"SP2600-12","23477-0000",4156,3993,"23434-1000"]
["23430-1301",80,"0  32 Hose","Flange",null,"SK385-0001",890,"17937-0001-P","SP2700-1027","SP1003-0111","934-0000","SP1004-09","SP2700-1027","SP2600-01",null,"SP2600-01","23477-0000",4156,3993,"23434-1000"]
["23430-1401",80,"0 32 Hose","Flange",null,"SK385-0001",890,"17937-0001-P","SP2700-1027","SP1003-0111","934-0000","SP1004-09","SP2700-1027","SP2600-12",null,"SP2600-12","23478-0000",4156,3993,"23434-1000"]
["23430-1441",80,"0  32 Hose","Flange",null,"SK385-0001",890,"17937-0001-P","SP2700-1027","SP1003-0111",3255,"SP1004-11","SP2700-1027","SP2600-12",null,"SP2600-12","23478-0000",4156,3993,"23434-1000"]
["23430-1501",80,"0 32 Hose","Flange",null,"SK385-0001",890,"17937-0001-P","SP2700-1027","SP1003-0111","934-0000","SP1004-09","SP2700-1027","SP2600-12",null,"SP2600-12","23478-0000",4156,3993,"23434-1000"]
["23430-1601",80,"0  32 Hose","Flange",null,"SK385-0001",890,"17937-0001-P","SP2700-1027","SP1003-0111","934-0000","SP1004-09","SP2700-1027","SP2600-12",null,"SP2600-12","23435-0000",4156,3993,"23434-1000"]
["23430-1641",80,"0 32 Hose","Flange",null,"SK385-0501",890,"920-0001-P","SP2700-1027","SP1003-0111","934-0000","SP1004-11","SP2700-1027","SP2600-12",null,"SP2600-12","23435-0000",4156,3993,"23434-1000"]
["23430-1701",80,"0  32 Hose","Flange",null,"SK385-0001",890,"17937-0001-P","SP2700-1027","SP1003-0111","934-0000","SP1004-09","SP2700-1027","SP2600-12",null,"SP2600-12","23437-0000",4156,3993,"23434-1100"]
["23480-2001",80,"1\" BSP","Foot",null,"SK229",890,"17937-0001-P","22626-0000","SP1003-09","934-0000","SP1004-09","SP2701-87","SP2601-42","SP2700-48",null,21966,4156,3993,"10329-200"]
["23580-100",80,"0  32 Hose","Crank",null,null,null,"-P"]
["23800-0201",60,"0  32 Hose","Crank","50410-\n1201",null,"3298-0000","22120-0001-P","92700-0060","91002-0010","18753-0090","91004-0110",null,null,null,null,null,null,"11830-0000"]
["23800-0201",60,"0 32 Hose","Crank","50410-\n1201","SK331-0251",3298,"22120-0001-P","SP2701-21","SP8019-01",22318,"SP1004-11",null,null,null,"SP2601-0461",22307,null,3992,"22304-01"]
["23800-0251",60,"0  32 Hose","Crank","50410-\n1251","SK331-0251",3298,"22120-0001-P","SP2701-21","SP8019-01",22308,"SP1004-10",null,null,null,"SP2601-0461",22307,null,3992,"22304-01"]
["23800-0251",60,"0 32 Hose","Crank","50410-\n1251",null,"3298-0000","22120-0001-P","96080-0080","91002-0010","22308-0000","91004-0100",null,null,null,null,null,null,"11830-0000"]
["23800-0301",60,"0  32 Hose","Crank","50410-\n1301",null,"3298-0000","22120-0001-P","92700-0060","91002-0010","18753-0090","91004-0110",null,null,null,null,null,null,"11830-0000"]
["23800-0351",60,"0  32 Hose","Crank","50410-\n1351","SK331-0251",3298,"22120-0001-P","SP2701-21","SP8019-01",22308,"SP1004-10",null,null,null,"SP2601-0461",22307,null,3992,"22304-01"]
["23800-0351",60,"0 32 Hose","Crank","50410-\n1401",null,"3298-0000","22120-0001-P","96080-0080","91002-0010","22308-0000","91004-0100",null,null,null,null,null,null,"11830-0000"]
["23800-0401",60,"0 32 Hose","Crank",null,"SK331-0251",3298,"22120-0001-P","SP2701-21","SP8019-01",22318,"SP1004-11",null,null,null,"SP2601-0461",22307,null,3992,"22304-01"]
["2570-0001",200,"1-3/4\"\nFlanged","Flange",null,"90019-0001","816-0000","17935-0001-P","6408-0000","91095-0060","834-0001","91005-0040","817-0000","92600-0040",null,null,"2567-0000","2574-0000","12062-0000"]
["2570-0011",200,"1-3/4\"\nFlanged","Flange",null,"90019-0001","816-0000","17935-0001-P","6408-0000","91095-0060","834-0001","91005-0040","817-0000","SP2700-50",null,null,"2567-0000","2574-0000","12062-0000"]
["2570-0011",200,"1-3/4\"\nFlanged","Flange",null,"SK19",816,"17935-0001-P",21849,"SP1005-04",834,"SP1005-04",null,"SP2700-50",null,"SP2600-04",21238,2574,9336]
["2570-0021",200,"1-3/4\"\nFlanged","Flange",null,"90019-0001","816-0000","17935-0001-P","6408-0000","91095-0060","834-0001","91005-0040","817-0000","92600-0040",null,null,"2567-0000","2574-0000","12062-0000"]
["2570-0051",200,"1-3/4\"\nFlanged","Flange",null,"90019-0001","816-0000","17935-0001-P","6408-0000","91095-0060","2551-0000","91005-0040","817-0000","92600-0040",null,null,"2567-0000","2574-0000","12062-0000"]
["2570-0151",200,"1-3/4\"\nFlanged","Flange",null,"90019-0001","816-0000","17935-0001-P","6408-0000","91095-0060","2551-0000","91005-0040","817-0000","92600-0040",null,null,"2567-0000","2574-0000","12062-0000"]
["2570-0211",200,"1-3/4\"\nFlanged","Flange",null,"90019-0001","816-0000","17935-0001-P","6408-0000","91095-0060","834-0001","91005-0040","817-0000","92600-0040",null,null,"2567-0000","2574-0000","12062-0000"]
["2570-3000",200,"1-3/4\"\nFlanged","Flange",null,"90019-0001","816-0000","17935-0001-P","6408-0000","91095-0060","834-0001","91005-0040","817-0000","92600-0040",null,null,"2567-0000","2574-0000","12062-0000"]
["2620-0001",20,"3/8\" NPT","Foot",null,"90020-0001","2995-0000","18673-0001-P","92700-0050","91002-0020","2907-0000","91002-0090","3078-0000","92600-0330",null,null,"688-0240",null,"11830-0000","2438-0000"]
["2620-0003",20,"3/8\" NPT","Foot",null,"90020-0003","2995-0000","18673-0003-P","92700-0050","91002-0020","2907-0000","91002-0090","3078-0000","92600-0330",null,null,"688-0240",null,"11830-0000"]
["2620-0051",20,"3/8\" NPT","Foot",null,"90020-0001","2995-0000","18673-0001-P","92700-0050","91002-0020","2907-0000","91002-0090","3078-0000","92600-0330",null,null,"688-0240",null,"11830-0000","2438-0000"]
["2620-0053",20,"3/8\" NPT","Foot",null,"90020-0003","2995-0000","18673-0003-P","92700-0050","91002-0020","2907-0000","91002-0090","3078-0000","92600-0330",null,null,"688-0240",null,"11830-0000","2438-0000"]
["2620-1001",20,"3/8\" NPT","Foot",null,"90020-0001","18753-0125","18673-0001-P","92700-0050","91002-0020","2907-0001","91002-0090",null,"92600-0130",null,"92600-0130","18753-0124",null,"11830-0000","18753-0122"]
["2620-1003",20,"3/8\" NPT","Foot",null,"90020-0003","18753-0125","18673-0003-P","92700-0050","91002-0020","2907-0001","91002-0090",null,"92600-0130",null,"92600-0130","18753-0124",null,"11830-0000","18753-0122"]
["2620-200",20,"3/8\" BSP","Foot",null,"SK20","2995-0030","673-0001-P","SP2700-05","SP1002-02","2907-0001","SP1002-09",null,null,null,"SP2600-09","688-21-24",null,3992,"2438-200"]
["2620-211",20,"3/8\" BSP","Foot","2620-200","SK20","2995-0030","673-0001-P","SP2700-05","SP1002-02","2907-0001","SP1002-09",null,null,null,"SP2600-09","688-21-24",null,3992,"2438-200"]
["2620-221",20,"3/8\" BSP","Foot","2620-200","SK20","2995-0030","673-0001-P","SP2700-05","SP1002-02","2907-0001","SP1002-09",null,null,null,"SP2600-09","355-07-24",null,3992,"2438-200"]
["2620-237",20,"3/8\" BSP","Foot",null,"SK20-37","2995-0030","673-0003-P","SP2700-05","SP1002-02","2907-0001","SP1002-09",null,null,null,"SP2600-09","688-21",null,3992,"2438-200"]
["2620-252",20,"3/8\" BSP","Foot",null,"SK20","2995-0030","673-0001-P","SP2700-05","SP1002-02","2907-0001","SP1002-09",null,null,null,"SP2600-09","355-07-24",null,3992,"2438-200"]
["2620-253",20,"3/8\" BSP","Foot",null,"SK20","2995-0030","673-0001-P","SP2700-05","SP1002-02","2907-0001","SP1002-09",null,null,null,"SP2600-09","355-07-24",null,3992,"2438-200"]
["2620-254",20,"3/8\" BSP","Foot","2620-252","SK20-05",2442,"673-0001-P","SP2700-05","SP1002-02",2441,"SP1002-01",null,null,null,"SP2600-09","355-07-24",null,"2623-254","2438-200"]
["2620-255",20,"3/8\" BSP","Foot",null,"SK20-05","2995-0030","673-0001-P","SP2700-05","SP1002-02",2441,"SP1010-06",null,null,null,"SP2600-09","355-07-24",null,3992,"2438-200"]
["2620-271",20,"3/8\" BSP","Foot",null,"SK20","2995-0030","673-0001-P","SP2700-05","SP1002-02","2907-0001","SP1002-09",null,null,null,"SP2600-09","355-07-24",null,3992,"2438-200"]
["2620-281",20,"3/8\" BSP","Foot","2620-252","SK20","2995-0030","673-0001-P","SP2700-05","SP1002-02","2907-0001","SP1002-09",null,null,null,"SP2600-09","355-07-24",null,3992,"2438-200"]
["2760-0001",10,"1/4\" NPT","Foot",null,"90020-0003","1189-0000","4528-0001-P","92700-0110","91002-0010","4271-0000","91002-0030","1041-0000","92600-0080",null,null,"1053-0000",null,"12066-0000","2767-0000"]
["2760-0003",20,"1/4\" NPT","Foot",null,"90023-0001","1189-0000","4528-0003-P","92700-0110","91002-0010","4271-0000","91002-0030","1041-0000","92600-0080",null,null,"1053-0000",null,"12066-0000","2767-0000"]
["29300-\n2101C",10,"3/8\" BSP","Flange",null,"SK404-0001","29308-0000","22405-0001-P","SP2701-1006","X3004-095G","29303-0000","SP1002-09","SP2701-1006","SP2601- 0463",null,"SP2601- 0463","29307-0020","29306-0000","29305-0000","29304-2000"]
["29300-\n21S1C",10,"3/8\" BSP","Flange",null,"SK404-0001","29308-0000","22405-0001-P","SP2701-1006","X3004-095G",null,null,"SP2701-1006","SP2601- 0463",null,"SP2601- 0463","29307-0020","29306-0000","29305-0000","29304-2000"]
["29300-\n2201C",10,"3/8\" BSP","Flange",null,"SK404-0001","29308-0000","22405-0001-P","SP2701-1006","X3004-095G","29303-0000","SP1002-09","SP2701-1006","SP2601- 0463",null,"SP2601- 0463","29307-0020","29306-0000","29305-0000","29304-2000"]
["29300-\n2401C",10,"3/8\" BSP","Flange",null,"SK404-0001","29308-0000","22405-0001-P","SP2701-1006","X3004-095G","29303-0000","SP1002-09","SP2701-1006","SP2601- 0463",null,"SP2601- 0463","29307-0030","29306-0000","29305-0000","29304-2000"]
["29300-\n2601C",10,"3/8\" BSP","Flange",null,"SK404-0001","29308-0000","22405-0001-P","SP2701-1006","X3004-095G","29303-0000","SP1002-09","SP2701-1006","SP2601- 0463",null,"SP2601- 0463","29307-0050","29306-0000","29305-0000","29304-2000"]
["29300-\n2731C",10,"3/8\" BSP","Flange",null,null,"X4020-244A","22405-0001-P","SP2701-1006","X3001-095F","Not Fitted","Not Fitted","SP2701-1006","SP2601- 0463",null,"SP2601- 0463","29307-0030",null,"29305-0100","29304-2100"]
["29300-\n2S01C",10,"3/8\" BSP","Flange",null,"SK404-0001","29308-0000","22405-0001-P","SP2701-1006","X3004-095G","29303-0000","SP1002-09","SP2701-1006","SP2601- 0463",null,"SP2601- 0463","29307-0040","29306-0000","29305-0000","29304-2000"]
["29300-2001",10,"3/8\" BSP","Flange",null,"SK404-0001","29308-0000","22405-0001-P","SP2701-1006","X3004-095G","29303-0000","SP1002-09","SP2701-1006","SP2601- 0463",null,"SP2601- 0463","29307-0000","29306-0000","29305-0000","29304-2000"]
["29300-2101",10,"3/8\" BSP","Flange",null,"SK404-0001","29308-0000","22405-0001-P","SP2701-1006","X3004-095G","29303-0000","SP1002-09","SP2701-1006","SP2601- 0463",null,"SP2601- 0463","29307-0020","29306-0000","29305-0000","29304-2000"]
["29300-2201",10,"3/8\" BSP","Flange",null,"SK404-0001","29308-0000","22405-0001-P","SP2701-1006","X3004-095G","29303-0000","SP1002-09","SP2701-1006","SP2601- 0463",null,"SP2601- 0463","29307-0020","29306-0000","29305-0000","29304-2000"]
["29300-2301",10,"3/8\" BSP","Flange",null,"SK404-0001","29308-0000","22405-0001-P","SP2701-1006","X3004-095G","29303-0000","SP1002-09","SP2701-1006","SP2601- 0463",null,"SP2601- 0463","29307-0040","29306-0000","29305-0000","29304-2000"]
["29300-2401",10,"3/8\" BSP","Flange",null,"SK404-0001","29308-0000","22405-0001-P","SP2701-1006","X3004-095G","29303-0000","SP1002-09","SP2701-1006","SP2601- 0463",null,"SP2601- 0463","29307-0030","29306-0000","29305-0000","29304-2000"]
["29300-2S01",10,"3/8\" BSP","Flange",null,"SK404-0001","29308-0000","22405-0001-P","SP2701-1006","X3004-095G","29303-0000","SP1002-09","SP2701-1006","SP2601- 0463",null,"SP2601- 0463","29307-0040","29306-0000","29305-0000","29304-2000"]
["29340-\n2101C",10,"3/8\" BSP","Flange",null,null,null,"-P"]
["29350-1101",10,"0  20 Hose","Flange",null,"SK23-0101",1126,"4528-0001-P","SP2701-14","SP1002-01",2763,"SP1002-02","SP2701-14","SP2601-0459",null,"SP2601-0459","29357-0000",2765,"AL6-200","29354-1100"]
["29370-\n2001C",10,null,null,null,null,null,"-P"]
["293S0-1001",10,"0  18 Hose","Flange",null,"SK23-0101",1126,"4S28-0001-P","SP2701-14","SP1002-01",2763,"SP1002-02","SP2701-14","SP2601-0459",null,"SP2601-0459","29357-0000",2765,"AL6-200","29354-1000"]
["29400-1001",20,"0  20 Hose","Flange",null,"SK404-0001","29308-0000","22405-0001-P","SP2701-1006","X3004-095G","2907-0001","SP1002-02","SP2701-1006","SP2601- 0457",null,"SP2601- 0457","29457-0010",null,3992,"29404-1100"]
["29400-10S1",20,"0  20 Hose","Flange",null,"SK404-0001","29308-0000","22405-0001-P","SP2701-1006","X3004-095G",2441,"SP1002-0152","SP2701-1006","SP2601- 0457",null,"SP2601- 0457","29457-0010",null,3992,"29404-1100"]
["29400-1101",20,"0  20 Hose","Flange",null,"SK404-0001","29308-0000","22405-0001-P","SP2701-1006","X3004-095G","2907-0001","SP1002-02","SP2701-1006","SP2601- 0457",null,"SP2601- 0457","29467-0000",null,3992,"29404-1100"]
["29400-1151",20,"0  20 Hose","Flange",null,"SK404-0001","29308-0000","22405-0001-P","SP2701-1006","X3004-095G",2441,"SP1002-0152","SP2701-1006","SP2601- 0457",null,"SP2601- 0457","29467-0000",null,3992,"29404-1100"]
["29410-1101",20,"0  20 Hose","Flange",null,"SK404-0001","29308-0000","18653-0001-P","SP2701-1006","X3004-095G","2907-0001","SP1002-02","SP2701-1006","SP2601- 0463",null,"SP2601- 0463","29417-0100",null,3992,"29414-1100"]
["29440-1001",20,"0  25 Hose","Crank",null,"SK402-0001","1985-0000","18653-0001-P","29441-0000","SP1004-09","2907-0001","SP1002-02",null,"SP2600-09",null,null,"29447-0000",null,9328,"29444-1000"]
["29440-1051",20,"0  25 Hose","Crank",null,"SK402-0001","1985-0000","18653-0001-P","29441-0000","SP1004-09",2441,"SP1002-0152",null,"SP2600-09",null,null,"29447-0000",null,9328,"29444-1000"]
["29440-1101",20,"0  25 Hose","Crank",null,"SK402-0001","1985-0000","18653-0001-P","29441-0000","SP1004-09","2907-0001","SP1002-02",null,"SP2600-09",null,null,"29447-0000",null,9328,"29444-1000"]
["29440-1201",20,"0  25 Hose","Crank",null,"SK402-0001","1985-0000","18653-0001-P","29441-0000","SP1004-09","2907-0001","SP1002-02",null,"SP2600-09",null,null,"29447-0000",null,9328,"29444-1000"]
["29450-1101",20,"0  20 Hose","Flange",null,"SK387-0001","299S-0030","673-0001-P","SP2700-0S","SP1002-01","2907-0001","SP1002-02","SP2700-05","SP2601- 0457",null,"SP2601- 0457","29457-0010",null,3992,"29454-1100"]
["29450-1201",20,"0  20 Hose","Flange",null,"SK387-0001","299S-0030","673-0001-P","SP2700-0S","SP1002-01","2907-0001","SP1002-02","SP2700-05","SP2601- 0457",null,"SP2601- 0457","29457-0020",null,3992,"29454-1200"]
["29450-1231",20,"0  20 Hose","Flange",null,"SK387-0001","2995-0030","673-0001-P","SP2700-05","SP1002-01",10818,"SP1002-02","SP2700-05","SP2601- 0457",null,"SP2601- 0457","29457-0020",null,3992,"29454-1200"]
["29450-1301",20,"0  20 Hose","Flange",null,"SK387-0001","299S-0030","673-0001-P","SP2700-0S","SP1002-01","2907-0001","SP1002-02","SP2700-05","SP2601- 0457",null,"SP2601- 0457","29457-0010",null,3992,"29454-1300"]
["29450-1401",20,"0  20 Hose","Flange",null,"SK387-0001","2995-0030","673-0001-P","SP2700-05","SP1002-01","2907-0001","SP1002-02","SP2700-05","SP2601- 0457",null,"SP2601- 0457","29457-0020",null,3992,"29454-1400"]
["29450-1431",20,"0  20 Hose","Flange",null,"SK387-0001","2995-0030","673-0001-P","SP2700-05","SP1002-01",10818,"SP1002-02","SP2700-05","SP2601- 0457",null,"SP2601- 0457","29457-0020",null,3992,"29454-1400"]
["29450-1601",20,"0  20 Hose","Flange",null,null,"X5251-049","653-0001-P","SP2701-1006","X3001-174F","Not  Fitted","Not Fitted","SP2701-1006","SP2601- 0457",null,"SP2601- 0457","29457-0040",null,"29405-0000","29454-1800"]
["29450-1641",20,"0  20 Hose","Flange",null,null,"2995-0030","653-0001-P","SP2701-1006","SP1002-01","2907-0001","SP1002-02","SP2701-1006","SP2601- 0457",null,"SP2601- 0457","29457-0040",null,3992,"29454-1600"]
["29450-1701",20,"0  20 Hose","Flange",null,null,"X5251-049","653-0001-P","SP2701-1006","X3001-174F","Not Fitted","Not Fitted","SP2701-1006","SP2601- 0457",null,"SP2601- 0457","29457-0050",null,"29405-0000","29454-1700"]
["29450-1801",20,"0  20 Hose","Flange",null,"SK387-0001","2995-0030","653-0001-P","SP2701-1006","SP1002-01","2907-0001","SP1002-02","SP2701-1006","SP2601- 0457",null,"SP2601- 0457","29457-0060",null,3992,"29454-1610"]
["29450-2131",20,"3/8\" BSP","Flange",null,"SK387-0001","2995-0030","673-0001-P","SP2700-05","SP1002-01",10818,"SP1002-02","SP2701-1006","SP2601- 0457",null,"SP2601- 0457","29457-0030",null,3992,"29454-1500"]
["29450-2231",20,"3/8\" BSP","Flange",null,"SK387-0001","2995-0030","673-0001-P","SP2700-05","SP1002-01",10818,"SP1002-02","SP2700-05","SP2601- 0457",null,"SP2601- 0457","29457-0020",null,3992,"29454-1400"]
["29460-10-\n1041",20,"020   Hose","Flange",null,null,"X4020-257A","653-0001-P","SP2701-1006","X3001-174F",null,null,"SP2701-1006","SP2601- 0457",null,"SP2601- 0457","29467-0000",null,"29405-0000","29454-1940"]
["29460-10-\n1051",20,"020   Hose","Flange",null,null,"X5251-049","653-0001-P","SP2701-1006","X3001-174F",null,null,"SP2701-1006","SP2601- 0457",null,"SP2601- 0457","29467-0000",null,"29405-0000","29454-1950"]
["29460-1001",20,"0  20 Hose","Flange",null,"SK401-0001","2995-0030","18653-0001-P","SP2701-1006","SP1002-01","2907-0001","SP1002-02","SP2701-1006","SP2601- 0457",null,"SP2601- 0457","29467-0000",null,3992,"29464-1000"]
["29460-1041*",20,"0  20 Hose","Flange","29460-10-\n1041",null,"X5251-049","653-0001-P","SP2701-1006","X3001-174F",null,null,"SP2701-1006","SP2601- 0457",null,"SP2601- 0457","29467-0000",null,"29405-0000","29454-1940"]
["29460-1051*",20,"0  20 Hose","Flange","29460-10-\n1051",null,"X5251-049","653-0001-P","SP2701-1006","X3001-174F",null,null,"SP2701-1006","SP2601- 0457",null,"SP2601- 0457","29467-0000",null,"29405-0000","29454-1950"]
["29460-1101",20,"0  20 Hose","Flange",null,"SK401-0001","2995-0030","18653-0001-P","SP2701-1006","SP1002-01","2907-0001","SP1002-02","SP2701-1006","SP2601- 0457",null,"SP2601- 0457","29467-0000",null,3992,"29464-1100"]
["29460-1201",20,"0  20 Hose","Flange",null,"SK401-0001","2995-0030","18653-0001-P","SP2701-1006","SP1002-01","2907-0001","SP1002-02","SP2701-1006","SP2601- 0457",null,"SP2601- 0457","29467-0000",null,3992,"29464-1100"]
["29460-1251",20,"0  20 Hose","Flange",null,"SK401-0001","2995-0030","18653-0001-P","SP2701-1006","SP1002-01",2441,"SP1002-0152","SP2701-1006","SP2601- 0457",null,"SP2601- 0457","29467-0000",null,3992,"29464-1100"]
["29460-1261",20,"0  20 Hose","Flange",null,null,"2995-0030","653-0001-P","SP2701-1006","SP1002-01","29462-0000","SP1002-09","SP2701-1006","SP2601- 0457",null,"SP2601- 0457","29467-0000",null,3992,"29464-1100"]
["29460-1301",20,"0  20 Hose","Flange",null,"SK401-0001","2995-0030","18653-0001-P","SP2701-1006","SP1002-01","2907-0001","SP1002-02","SP2701-1006","SP2601- 0457",null,"SP2601- 0457","29467-0000",null,3992,"29464-1300"]
["29460-1401",20,"0  20 Hose","Flange",null,"SK401-0001","2995-0030","18653-0001-P","SP2701-1006","SP1002-01","2907-0001","SP1002-02","SP2701-1006","SP2601- 0457",null,"SP2601- 0457","29467-0010",null,3992,"29464-1200"]
["29460-1431",20,"0  20 Hose","Flange",null,"SK401-0001","2995-0030","18653-0001-P","SP2701-1006","SP1002-01",10818,"SP1002-02","SP2701-1006","SP2601- 0457",null,"SP2601- 0457","29467-0010",null,3992,"29464-1200"]
["29460-1631",20,"0  20 Hose","Flange",null,null,"X5251-049","18653-0001-P","SP2701-1006","X3001-174F",null,null,"SP2701-1006","SP2601- 0457",null,"SP2601- 0457","29467-0010",null,"29405-0000","29454-1230"]
["29460-1701",20,"0  20 Hose","Flange",null,null,"X5251-049","18653-0001-P","SP2701-1006","X3001-174F",null,null,"SP2701-1006","SP2601- 0457",null,"SP2601- 0457","29467-0020",null,"29405-0000","29454-1301"]
["29460-2231",20,"0  20 Hose","Flange",null,"SK387-0001","2995-0030","18653-0001-P","SP2701-1006","SP1002-01",10818,"SP1002-02","SP2701-1006","SP2601- 0457",null,"SP2601- 0457","29457-0030",null,3992,"29464-1500"]
["29460-2501",20,"3/8\" BSP","Flange",null,"SK401-0001","2995-0030","18653-0001-P","SP2701-1006","SP1002-01","2907-0001","SP1002-02","SP2701-1006","SP2601- 0457",null,"SP2601- 0457","29467-0010",null,3992,"29464-1200"]
["29470-\n2031C",20,"3/8\" BSP","Flange",null,"SK405-0001","29476-0000","18653-0001-P","SP2701-1006","X3004-095G",10818,"SP1002-02","SP2701-1006","SP2601- 0463",null,"SP2601- 0463","29477-0010",null,"29475-0000","29474-2000"]
["29470-\n2201C",20,"3/8\" BSP","Flange",null,"SK405-0001","29476-0000","18653-0001-P","SP2701-1006","X3004-095G","2907-0001","SP1002-02","SP2701-1006","SP2601- 0463",null,"SP2601- 0463","29477-0000",null,"29475-0000","29474-2000"]
["29470-\n2231C",20,"3/8\" BSP","Flange",null,"SK405-0001","29476-0000","18653-0001-P","SP2701-1006","X3004-095G",10818,"SP1002-02","SP2701-1006","SP2601- 0463",null,"SP2601- 0463","29477-0020",null,"29475-0000","29474-2000"]
["29470-\n2301C",20,"3/8\" BSP","Flange",null,"SK405-0001","29476-0000","18653-0001-P","SP2701-1006","X3004-095G","2907-0001","SP1002-09","SP2701-1006","SP2601- 0463",null,"SP2601- 0463","29477-0030",null,"29475-0000","29474-2000"]
["29470-\n2331C",20,"3/8\" BSP","Flange",null,"SK405-0001","29476-0000","18653-0001-P","SP2701-1006","X3004-095G",10818,"SP1002-02","SP2701-1006","SP2601- 0463",null,"SP2601- 0463","29477-0030",null,"29475-0000","29474-2000"]
["29470-\n2431C",20,"3/8\" BSP","Flange",null,"SK405-0001","29476-0000","18653-0001-P","SP2701-1006","X3004-095G",10818,"SP1002-02","SP2701-1006","SP2601- 0463",null,"SP2601- 0463","29477-0040",null,"29475-0000","29474-2000"]
["29470-\n2S31C",20,"3/8\" BSP","Flange",null,"SK405-0001","29476-0000","18653-0001-P","SP2701-1006","X3004-095G",10818,"SP1002-02","SP2701-1006","SP2601- 0463",null,"SP2601- 0463","29477-0020",null,"29475-0000","29474-2000"]
["29470-1101",20,"0  16 Hose","Flange",null,"SK405-0001","29476-0000","18653-0001-P","SP2701-1006","X3004-095G","2907-0001","SP1002-02","SP2701-1006","SP2601- 0463",null,"SP2601- 0463","29467-0020",null,"29475-0000","29474-1000"]
["29470-1231",20,"0  16 Hose","Flange",null,"SK405-0001","29476-0000","18653-0001-P","SP2701-1006","X3004-095G",10818,"SP1002-02","SP2701-1006","SP2601- 0463",null,"SP2601- 0463","29477-0020",null,"29475-0000","29474-1000"]
["29470-1231C",20,"0  16 Hose","Flange",null,"SK405-0001","29476-0000","18653-0001-P","SP2701-1006","X3004-095G",10818,"SP1002-02","SP2701-1006","SP2601- 0463",null,"SP2601- 0463","29477-0020",null,"29475-0000","29474-1000"]
["29470-2031",20,"3/8\" BSP","Flange",null,"SK405-0001","29476-0000","18653-0001-P","SP2701-1006","X3004-095G",10818,"SP1002-02","SP2701-1006","SP2601- 0463",null,"SP2601- 0463","29477-0010",null,"29475-0000","29474-2000"]
["29470-2131",20,"3/8\" BSP","Flange",null,"SK405-0001","29476-0000","18653-0001-P","SP2701-1006","X3004-095G",10818,"SP1002-02","SP2701-1006","SP2601- 0463",null,"SP2601- 0463","29477-0000",null,"29475-0000","29474-2000"]
["29470-2131C",20,"3/8\" BSP","Flange",null,"SK405-0001","29476-0000","18653-0001-P","SP2701-1006","X3004-095G",10818,"SP1002-02","SP2701-1006","SP2601- 0463",null,"SP2601- 0463","29477-0000",null,"29475-0000","29474-2000"]
["29470-2231",20,"3/8\" BSP","Flange",null,"SK405-0001","29476-0000","18653-0001-P","SP2701-1006","X3004-095G",10818,"SP1002-02","SP2701-1006","SP2601- 0463",null,"SP2601- 0463","29477-0020",null,"29475-0000","29474-2000"]
["29470-2301",20,"3/8\" BSP","Flange",null,"SK405-0001","29476-0000","18653-0001-P","SP2701-1006","X3004-095G","2907-0001","SP1002-09","SP2701-1006","SP2601- 0463",null,"SP2601- 0463","29477-0030",null,"29475-0000","29474-2000"]
["29470-2331",20,"3/8\" BSP","Flange",null,"SK405-0001","29476-0000","18653-0001-P","SP2701-1006","X3004-095G",10818,"SP1002-02","SP2701-1006","SP2601- 0463",null,"SP2601- 0463","29477-0030",null,"29475-0000","29474-2000"]
["29470-2351",20,"3/8\" BSP","Flange",null,"SK405-0001","29476-0000","18653-0001-P","SP2701-1006","X3004-095G",2441,"SP1002-01","SP2701-1006","SP2601- 0463",null,"SP2601- 0463","29477-0030",null,"29475-0000","29474-2000"]
["29470-23S1C",20,"3/8\" BSP","Flange",null,"SK405-0001","29476-0000","18653-0001-P","SP2701-1006","X3004-095G",2441,"SP1002-01","SP2701-1006","SP2601- 0463",null,"SP2601- 0463","29477-0030",null,"29475-0000","29474-2000"]
["29470-2431",20,"3/8\" BSP","Flange",null,"SK405-0001","29476-0000","18653-0001-P","SP2701-1006","X3004-095G",10818,"SP1002-02","SP2701-1006","SP2601- 0463",null,"SP2601- 0463","29477-0040",null,"29475-0000","29474-2000"]
["29470-2531",20,"3/8\" BSP","Flange",null,"SK405-0001","29476-0000","18653-0001-P","SP2701-1006","X3004-095G",10818,"SP1002-02","SP2701-1006","SP2601- 0463",null,"SP2601- 0463","29477-0020",null,"29475-0000","29474-2000"]
["29480-\n2031C",20,"3/8\" BSP","Flange",null,"SK405-0001","29476-0000","18653-0001-P","SP2701-1006","X3004-095G",10818,"SP1002-02","SP2701-1006","SP2601- 0463",null,"SP2601- 0463","29487-0000",null,"29475-0000","29484-2000"]
["29480-\n2231C",20,"3/8\" BSP","Flange",null,"SK405-0001","29476-0000","18653-0001-P","SP2701-1006","X3004-095G",10818,"SP1002-02","SP2701-1006","SP2601- 0463",null,"SP2601- 0463","29486-0000",null,"29475-0000","29484-2000"]
["29480-2031",20,"3/8\" BSP","Flange",null,"SK405-0001","29476-0000","18653-0001-P","SP2701-1006","X3004-095G",10818,"SP1002-02","SP2701-1006","SP2601- 0463",null,"SP2601- 0463","29487-0000",null,"29475-0000","29484-2000"]
["29480-2131",20,"3/8\" BSP","Flange",null,"SK405-0001","29476-0000","18653-0001-P","SP2701-1006","X3004-095G",10818,"SP1002-02","SP2701-1006","SP2601- 0463",null,"SP2601- 0463","29486-0000",null,"29475-0000","29484-2000"]
["29480-2151",20,"3/8\" BSP","Flange",null,"SK405-0001","29476-0000","18653-0001-P","SP2701-1006","X3004-095G",2441,"SP1002-01","SP2701-1006","SP2601- 0463",null,"SP2601- 0463","29486-0000",null,"29475-0000","29484-2000"]
["29480-2231",20,"3/8\" BSP","Flange",null,"SK405-0001","29476-0000","18653-0001-P","SP2701-1006","X3004-095G",10818,"SP1002-02","SP2701-1006","SP2601- 0463",null,"SP2601- 0463","29486-0000",null,"29475-0000","29484-2000"]
["29480-2431",20,"3/8\" BSP","Flange",null,null,"29476-0000","18653-0001-P","SP2701-1006","X3004-095G",10818,"SP1002-02","SP2701-1006","SP2601- 0463",null,"SP2601- 0463","29487-0100",null,"29475-0000","29484-2000"]
["29490-\n2001C",20,"3/8\" BSP","Flange",null,"SK405-0001","29476-0000","18653-0001-P","SP2701-1006","X3004-095G",10818,"SP1002-02","SP2701-1006","SP2601- 0463",null,"SP2601- 0463","29497-0000",null,"29475-0000","29494-2000"]
["29500-1101",40,"0 28 Hose","Flange",null,"SK384-0001",3298,"1210-0001-P","SP2700-1027","SP1002-02",490,"SP1003-01","SP2700-1027","SP2601-0451",null,"SP2601-0451","29517-0000",7883,3992,"29504-1000"]
["29500-1201",40,"0 28 Hose","Flange",null,"SK384-0001",3298,"1210-0001-P","SP2700-1027","SP1002-02",490,"SP1003-01","SP2700-1027","SP2601-0451",null,"SP2601-0451","29518-0000",7883,3992,"29504-1000"]
["29500-1251",40,"0 28 Hose","Flange",null,"SK384-0001",3298,"1210-0001-P","SP2700-1027","SP1002-02",10336,"SP1003-09","SP2700-1027","SP2601-0451",null,"SP2601-0451","29518-0000",7883,3992,"29504-1000"]
["29500-1351",40,"0 28 Hose","Flange","New Pipework","SK384-0001",3298,"1210-0001-P","SP2700-1027","SP1002-02",10336,"SP1003-09","SP2700-1027","SP2601-0451",null,"SP2601-0451","29518-0000",7883,3992,"29504-1000"]
["29500-1401",40,"0 28 Hose","Flange",null,"SK384-0001",3298,"1210-0001-P","SP2700-1027","SP1002-02",490,"SP1003-01","SP2700-1027","SP2601-0451",null,"SP2601-0451","29503-0000",7883,3992,"29504-1000"]
["29500-1451",40,"0 28 Hose","Flange",null,"SK384-0001",3298,"1210-0001-P","SP2700-1027","SP1002-02",10336,"SP1003-09","SP2700-1027","SP2601-0451",null,"SP2601-0451","29503-0000",7883,3992,"29504-1000"]
["29500-1501",40,"0 28 Hose","Flange",null,"SK384-0001",3298,"1210-0001-P","SP2700-1027","SP1002-02",490,"SP1003-01","SP2700-1027","SP2601-0451",null,"SP2601-0451","29516-0000",7883,3992,"29504-1000"]
["29500-1901",40,"0 28 Hose","Flange",null,"SK384-0001",3298,"1210-0001-P","SP2700-1027","SP1002-02",490,"SP1003-01","SP2700-1027","SP2601-0451",null,"SP2601-0451","29507-0020",7883,3992,"29504-1000"]
["29500-3001",40,"0 28 Hose","Flange","29500-\n1001","SK384-0001",3298,"1210-0001-P","SP2700-1027","SP1002-02",490,"SP1003-01","SP2700-1027","SP2601- 0452",null,"SP2601- 0452","29507-0000",7883,3992,"29504-1000"]
["29520-2001",40,"3/4\" BSP","Flange",null,"SK239",3298,"1210-0001-P","22617-0010","SP1002-02",490,"SP1003-01","SP2701-21","SP2600-01",null,"SP2600-01","29527-0000",7883,3992,"10554-200"]
["29530-2001",40,"3/4\" BSPF","Crank",null,null,3298,"1210-0001-P","SP2700-1027","X3001-095F",490,"SP1003-01",null,"SP2600- 0025",null,"SP2600- 0025","29537-0000",7883,"29535-0000","29534-2000"]
["29540-1001",40,"0 32 Hose","Bracket",null,null,3298,"1210-0001-P","SP2700-1027","X3001-095F",490,"SP1003-01",null,"SP601-0451",null,"SP601-0451","29547-0100",null,"29545-1101","29544-1000"]
["29540-1101",40,"0  32 Hose","Flange",null,null,3298,"1210-0001-P","SP2700-1027","X3001-095F",490,"SP1003-01",null,"SP601-0451",null,"SP601-0451","29547-0100",null,"29545-1101","29544-1000"]
["29540-1201",40,"0 32 Hose","Bracket",null,null,3298,"1210-0001-P","SP2700-1027","X3001-095F",490,"SP1003-01",null,"SP601-0451",null,"SP601-0451","29547-0100",null,"29545-1201","29544-1000"]
["29540-1301",40,"0  32 Hose","Flange",null,null,3298,"1210-0001-P","SP2700-1027","X3001-095F",490,"SP1003-01",null,"SP601-0451",null,"SP601-0451","29547-0100",null,"29545-1201","29544-1000"]
["29600-1001",80,"0 32 Hose","Flange","New Pipework","SK385-0101",890,"17937-0001-P","SP6080- 0469","SP1003-0111","934-0000","SP1004-09","SP2700-1027","SP2600- 0500",null,"SP2600- 0500","29607-0000",4156,3993,"29604-1000"]
["29600-1101",80,"0  32 Hose","Flange",null,"SK385-0101",890,"17937-0001-P","SP6080- 0469","SP1003-0111","934-0000","SP1004-09","SP2700-1027","SP2600- 0500",null,"SP2600- 0500","29606-0000",4156,3993,"29604-1000"]
["29600-1201",80,"0  32 Hose","Flange",null,"SK385-0101",890,"17937-0001-P","SP6080- 0469","SP1003-0111","934-0000","SP1004-09","SP2700-1027","SP2600- 0500",null,"SP2600- 0500","29608-0000",4156,3993,"29604-1200"]
["29600-1641",80,"0 32 Hose","Flange",null,"SK385-0601",890,"920-0001-P","SP6080- 0469","SP1003-0111",3255,"SP1004-11","SP2700-1027","SP2600- 0500",null,"SP2600- 0500","29609-0000",4156,3993,"29604-1300"]
["29600-1741",80,"0  32 Hose","Flange",null,"SK385-0601",890,"920-0001-P","SP6080- 0469","SP1003-0111",3255,"SP1004-11","SP2700-1027","SP2600- 0500",null,"SP2600- 0500","29606-0200",4156,3993,"29604-1600"]
["29600-1801",80,"0  32 Hose","Flange",null,"SK385-0101",890,"17937-0001-P","SP6080- 0469","SP1003-0111","934-0000","SP1004-09","SP6080- 0469","SP2600- 0500",null,"SP2600- 0500","29609-0100",4156,3993,"29604-1300"]
["29620-2001",80,"1\" BSP","Flange",null,"SK229",890,"17937-0001-P","22617-0010","SP1003-09","934-0000","SP1004-09","SP2701-21","SP2600-01",null,"SP2600-01","29627-0000",4156,3993,"10329-200"]
["29630-1001",80,"0  32 Hose","Flange","29640-\n1101","SK385-0601",890,"920-0001-P","SP6080- 0469","SP1003-0111","934-0000","SP1004-09","SP2700-1027","SP2601- 0468",null,"SP2601- 0468","29637-0000",4156,3993,"29634-1000"]
["29630-1101",80,"0  32 Hose","Flange","29630-\n1201","SK385-0601",890,"920-0001-P","SP6080- 0469","X5258-013","934-0000","SP1004-09","SP2700-1027","SP2601- 0468",null,"SP2601- 0468","29637-0000",4156,3993,"29634-1100"]
["29630-1141",80,"0 32 Hose","Flange","29630-\n1241","SK385-0601",890,"920-0001-P","SP6080- 0469","X5258-013",3255,"SP1004-11","SP2700-1027","SP2601- 0468",null,"SP2601- 0468","29637-0000",4156,3993,"29634-1100"]
["29630-1201*",80,"0 32 Hose","Flange",null,"SK385-0601",890,"920-0001-P","SP6080- 0469","X5258-013","934-0000","SP1004-09","SP2700-1027","SP2601- 0468",null,"SP2601- 0468","29637-0100",4156,3993,"29634-1000"]
["29630-1241*",80,"0  32 Hose","Flange",null,"SK385-0601",890,"920-0001-P","SP6080- 0469","X5258-013",3255,"SP1004-11","SP2700-1027","SP2601- 0468",null,"SP2601- 0468","29637-0100",4156,3993,"29634-1100"]
["29640-1001",80,"0 32 Hose","Flange",null,"SK385-0101",890,"17937-0001-P","SP6080- 0469","SP1003-0111","934-0000","SP1004-09","SP2700-1027","SP2600- 0500",null,"SP2600- 0500","29647-0000",4156,3993,"29604-1000"]
["29640-1101",80,"0 32 Hose","Flange",null,"SK385-0101",890,"17937-0001-P","SP6080- 0469","SP1003-0111","934-0000","SP1004-09","SP2700-1027","SP2600- 0500",null,"SP2600- 0500","29647-0000",4156,3993,"29604-1300"]
["29700-1101",120,"0  45 Hose","Flange",null,"SK386-0001",890,"17018-0001-P","SP6080- 0469","SP1003-0111","23341-0000","SP1004-09","SP2701-0903","SP2600-11",null,"SP2600-11","29707-0000",4156,3993,"29704-1200"]
["29700-1201",120,"0  45 Hose","Flange",null,"SK386-0001",890,"17018-0001-P","SP6080- 0469","SP1003-0111","23341-0000","SP1004-09","SP2701-0903","SP2600-11",null,"SP2600-11","29708-0000",4156,3993,"29704-1200"]
["29700-1301",120,"0  45 Hose","Flange",null,"SK386-0001",890,"17018-0001-P","SP6080- 0469","SP1003-0111","23341-8000","SP1004-09","SP2701-0903","SP2600-11",null,"SP2600-11","29707-0000",4156,3993,"29704-1300"]
["29700-1331",120,"0  45 Hose","Flange",null,"SK386-0001",890,"17018-0001-P","SP6080- 0469","SP1003-0111","23342-0000","SP1004-09","SP2701-0903","SP2600-11",null,"SP2600-11","29707-0000",4156,3993,"29704-1300"]
["29700-1401",120,"0  45 Hose","Flange",null,"SK386-0001",890,"17018-0001-P","SP6080- 0469","SP1003-0111","23341-0000","SP1004-09","SP2701-0903","SP2600-11",null,"SP2600-11","29708-0100",4156,3993,"29704-1400"]
["29750-1001",200,"0  38 Hose","Foot",null,null,"X4020-399A","836-0001-P",21849,"X5255-002","29752-0000","SP1005-04","SP2701-1014","SP2600-11",null,"SP2600-11","29757-0000",2574,"29805-0000","29734-1000"]
["29770-0001",200,"1-1/2\"\nFlanged","Flange",null,null,816,"17935-0001-P",21849,"SP1095- 0640",834,"SP1005-04","SP2700- 0050","SP2600-32",null,null,"21239-0020",2574,9336,10634]
["29800-1001",270,"0  51 Hose","Foot",null,null,"X4020-399A","6760-0001-P",21849,"X5255-002","29802-0000","SP1005-04","SP2701-1014","SP2600-11",null,"SP2600-11","29807-0000",2574,"29805-0000","29804-1000"]
["29830-0001",300,"2-1/4\"\nFlanged","Flange",null,"SK424-0001","X4020-399A","17938-0001-P",21849,"X3001-176F","29838-0000","X3001-205F","SP2701-54","SP2601-37",null,"SP2601-37","29827-0100",2574,"29825-0000","29834-\n0000*"]
["29830-0101",300,"2-1/4\"\nFlanged","Flange",null,"SK424-0001","X4020-399A","17938-0001-P",21849,"X3001-176F","29838-0000","X3001-205F","SP2701-54","SP2601-37",null,"SP2601-37","29827-0100",2574,"29825-0100","29834-\n0000*"]
["29850-0031",370,"2-3/4\"\nFlanged","Flange","29880-\n0001","SK410","X4020-424A","17420-0001-P",21849,"SP1094- 0060","23342-0000","SP1004-09","SP2701-54","SP2601- 0469",null,"SP2601- 0469","29857-0000","18787-6000","18784-1000","18783-0000"]
["29860-2001",470,"2-1/2\"\nFlanged","Foot",null,"SK410","X4020-424A","17240-0001-P",21849,"X5255-002","29862-0000","X3001-207F","SP2701-54","SP2601- 0458",null,"SP2601- 0458","29867-0000","29866-0000","29865-0000","29864-2000"]
["29860-2101",470,"2-1/2\"\nFlanged","Foot",null,"SK410","X4020-424A","17240-0001-P",21849,"X5255-002","29862-0000","X3001-207F","SP2701-54","SP2601- 0458",null,"SP2601- 0458","29867-0000","29866-0000","29865-0000","29864-2100"]
["29860-2201",470,"2-1/2\"\nFlanged","Foot","SK412- 0001","SK410","X4020-424A","17240-0001-P",21849,"X5255-002","29862-0200","X3001-207F","SP2701-54","SP2601- 0458",null,"SP2601- 0458","29867-0000","29866-0000","29865-0000","29864-2000"]
["29870-2001",470,"2-1/2\"\nFlanged","Foot",null,"SK410","X4020-424A","17240-0001-P",21849,"X5255-002","29862-0200","X3001-207F","SP2701-54","SP2601- 0458",null,"SP2601- 0458","29867-0000","29866-0000","29865-0000","29864-2000"]
["29870-2101",470,"2-1/2\"\nFlanged","Foot",null,"SK410","X4020-424A","17240-0001-P",21849,"X5255-002","29862-0200","X3001-207F","SP2701-54","SP2601- 0458",null,"SP2601- 0458","29867-0000","29866-0000","29865-0000","29864-2000"]
["29880-0001",470,"2-3/4\"\nFlanged",null,"Respecified","SK410","X4020-424A","17240-0001-P",21849,"X3001-180F","29862-0100","X3001-207F","SP2701-54","SP2601- 0469",null,"SP2601- 0469","29887-0000","29866-0000","29885-0000","29884-0000"]
["29880-0101",470,"2-3/4\"\nFlanged","Flange","29890-\n0101","SK410","X4020-424A","17240-0001-P",21849,"X3001-180F","29862-0100","X3001-207F","SP2701-54","SP2601- 0469",null,"SP2601- 0469","29887-0100","29866-0000","29885-0000","29884-0000"]
["29880-0201",470,"2-3/4\"\nFlanged","Flange",null,"SK410",null,"17240-0001-P",21849,"X3001-207F","29862-0100","X3001-207F","SP2701-54","SP2601- 0469",null,"SP2601- 0469","29887-0100","29866-0000","29885-0000","29884-0100"]
["29890-0001",470,"2-3/4\"\nFlanged","Flange",null,"SK410",null,"17240-0001-P",21849,"X3001-180F","29862-0100","X3001-207F","SP2701-54","SP2601- 0469",null,"SP2601- 0469","29887-0100","29866-0000","29885-0000","29884-0200"]
["29S00-1001",40,"0 28 Hose","Flange",null,"SK384-0001",3298,"1210-0001-P","SP2700-1027","SP1002-02",490,"SP1003-01","SP2700-1027","SP2601-0451",null,"SP2601-0451","29508-0000",7883,3992,"29504-1000"]
["30190-0000",130,"1-3/4\"\nFlanged","Flange",null,null,"92000-0560","30919-0001-P","18753-0342","18753-0495","30192-0000",null,null,"18753-0521","18753-0522","18753-0521","Proprietary",30193,"30914-1000","Proprietary"]
["30190-0001",130,"1-3/4\"\nFlanged","Flange",null,null,"92000-0560","30919-0001-P","18753-0342","18753-0495","30192-0000",null,null,"18753-0521","18753-0522","18753-0521","Proprietary",30193,"30914-1000","Proprietary"]
["30410-9001",40,"1-1/2\" NPT","Flange",null,null,"18753-0133","1210-0001-P","96080-0080"]
["30890-0001",130,"2\" Hose","Flange",null,null,"18753-0343","30919-0001-P","18753-0342","18753-0495","30929-1000","18753-0495",null,"18753-0521","18753-0469","18753-0521","30903-1000","30915-1000","30914-1000","30901-1000"]
["30890-0051",130,"2\" Hose","Flange",null,null,"18753-0343","30919-0001-P","18753-0342","18753-0495",30933,"18753-0495",null,"18753-0521",null,"18753-0521","30903-1000","30915-1000","30914-1000"]
["30891-0001",130,"2\" Hose","Flange",null,null,"18753-0343","30919-0001-P","18753-0342","18753-0495","30929-1000","18753-0495",null,"18753-0521",null,"18753-0521","30906-1000","30915-1000","30914-1000"]
["30891-0002",130,"2\" Hose","Flange",null,null,"18753-0343","30919-0001-P","18753-0342","18753-0495","30929-1000","18753-0495",null,"18753-0521",null,"18753-0521","30906-1000","30915-1000","30914-1000"]
["30892-0001",130,"2\" Hose","Flange",null,"90135-0001","18753-0343","30919-0001-P","18753-0342","18753-0346","30929-1000","18753-0346",null,"With Shaft Assembly",null,"With Shaft Assembly","30908-0000","30915-1000","30914-1000","30901-0000"]
["30910-0000",130,"2\" Hose","Foot",null,"90135-0001","18753-0343","30919-0001-P","18753-0342","18753-0346","30929-1000","18753-0346",null,"With Shaft Assembly",null,"With Shaft Assembly","30912-1000","30915-1000","30914-1000","30911-1000"]
["30940-0001",130,"2\" Hose","Foot",null,"90135-0001","18753-0343","30919-0001-P","18753-0342","18753-0346","30929-1000","18753-0346",null,"With Shaft Assembly",null,"With Shaft Assembly","30912-1000","30915-1000","30914-1000","30911-1000"]
["30940-0011",130,"2\" Hose","Foot",null,"90135-0001","18753-0343","30919-0001-P","18753-0342","18753-0346","30929-1000","18753-0346",null,"With Shaft Assembly",null,"With Shaft Assembly","30912-1000","30915-1000","30914-1000","30911-1000"]
["3110-0001",200,"2\" Flanged","Flange",null,"90019-0001","816-0000","17935-0001-P","6408-0000","91006-0090","834-0001","91005-0040","817-0000","92600-0040",null,null,"2567-0000","2574-0000","12062-0000","Not for Sale"]
["3110-0011",200,"2\" Flanged","Flange",null,"90019-0001","816-0000","17935-0001-P","6408-0000","91006-0090","834-0001","91005-0040","817-0000","92600-0040",null,null,"2567-0000","2574-0000","12062-0000","Not for Sale"]
["3190-0001",80,null,null,null,null,"890-0000","17937-0001-P","92700-0070","91003-0010","7873-0000","91003-0020","913-0000","92600-0060","914-0000",null,"Obsolete","7868-0000","11831-0000","Obsolete"]
["3200-0011",500,"2\" NPT","Foot",null,"90029-0001","3209-0000","2999-0001-P","3222-0000","91006-0050","3210-0000","91006-0030","3214-0000","92600-0160",null,"92600-0150","3207-0000","3211-0000","12069-0000","3204-0000"]
["3200-0011",500,"2\" NPT","Foot",null,"90029-0001","3209-0000","2999-0001-P","3222-0000","91006-0050","3210-0000","91006-0030","3214-0000","92600-0160","3213-0000","92600-0150","3207-0000","3211-0000","12069-0000","3204-0000"]
["3200-01",500,"2\" BSP","Foot",null,"SK29",3209,"2999-0001-P",9309,"SP1006-05",3210,"SP1006-03","SP2701-21","SP2600-16","SP2700-58","SP2600-15",3207,9316,9448,9444]
["3240-0011",200,"2\" Flanged","Flange",null,"90019-0001","816-0000","17935-0001-P","6408-0000","91095-0060","834-0001","91005-0040","817-0000","92600-0040",null,null,"2567-0000","2574-0000","12062-0000","Proprietary"]
["3240-1001",200,"2\" Flanged","Flange",null,"90019-0001","816-0000","17935-0001-P","6408-0000","91095-0060","834-0001","91095-0040","817-0000","92600-0040",null,null,"2567-0000","2574-0000","12062-0000","Proprietary"]
["3270-0000",40,"3/4\" BSP","Flange",null,"SK33",3298,"1210-0001-P","SP2701-21","SP1002-02",7876,"SP1003-01","SP2701-21","SP2600-01","SP2700-58","SP2600-01",3277,7883,3275,3274]
["3270-0001",40,"3/4\" NPT","Flange",null,"90033-0001","3298-0000","1210-0001-P","92700-0060","91002-0020","7884-0000","91003-0010","92700-0180","92600-0070",null,null,"3277-0000",null,"11830-0000","3274-0000"]
["3270-1951",40,"3/4\" BSP","Flange",null,"SK33",3298,"1210-0001-P","SP2701-21","SP1002-02",10538,"SP1003-09","SP2701-21","SP2601-0451",null,"SP2601-0451","23396-0000","Assy 5211",3992,"3274-200"]
["3270-20",40,"3/4\" BSP","Flange",null,"SK33",3298,"1210-0001-P","SP2701-21","SP1002-02",7876,"SP1003-01","SP2701-21","SP2600-07",null,null,3277,7883,3992,"3274-200"]
["3270-200",40,"3/4\" BSP","Flange","29500-\n1001","SK271",3298,"1210-0001-P","SP2701-21","SP1002-02",7876,"SP1003-01","SP2701-21","SP2600-07",null,null,3277,7883,3992,"3274-200"]
["3270-205",40,"3/4\" BSP","Flange",null,"SK33",3298,"1210-0001-P","SP2701-21","SP1002-02",10538,"SP1003-09","SP2701-21","SP2600-07",null,null,3277,"Assy 5211",3992,"3274-200"]
["3270-2101",40,"3/4\" BSP","Flange",null,"SK271",3298,"1210-0001-P","SP2701-21","SP1002-02",7876,"SP1003-01","SP2701-21","SP2600-07",null,null,3277,7883,3992,"3274-2100"]
["3270-2301",40,"3/4\" BSP","Flange",null,"SK33",3298,"1210-0001-P","SP2701-21","SP1002-02",7876,"SP1003-01","SP2701-21","SP2600-07",null,null,3277,7883,3992,"3274-2100"]
["3270-2401",40,"3/4\" BSP","Flange",null,"SK33",3298,"1210-0001-P","SP2701-21","SP1002-02",7876,"SP1003-01","SP2701-21","SP2600-07",null,null,3277,7883,3992,"3274-2100"]
["3270-241",40,"3/4\" BSP","Flange",null,"SK271",3298,"1210-0001-P","SP2701-21","SP1002-02",7876,"SP1003-01","SP2701-21","SP2600-07",null,null,3277,7883,3992,"3274-200"]
["3270-251",40,"3/4\" BSP","Flange",null,"SK33",3298,"1210-0001-P","SP2701-21","SP1002-02",7876,"SP1003-01","SP2701-21","SP2600-07",null,null,3277,"Assy 7884",3992,"3274-200"]
["3270-261",40,"3/4\" BSP","Flange",null,"SK33",3298,"1210-0001-P","SP2701-21","SP1002-02",7876,"SP1003-01","SP2701-21","SP2600-07",null,null,3277,"Assy 7884",3992,"3274-200"]
["3270-271",40,"3/4\" BSP","Flange",null,"SK271",3298,"1210-0001-P","SP2701-21","SP1002-02",7876,"SP1003-01","SP2701-21","SP2600-07",null,null,3277,7883,3992,"3274-200"]
["3270-2801",40,"3/4\" BSP","Flange",null,"SK271",3298,"1210-0001-P","SP2701-21","SP1002-02",7876,"SP1003-01","SP2701-21","SP2601-0451",null,"SP2601-0451","23027-0000",7883,3992,"3274-200"]
["3280-200",40,"3/4\" BSP","Flange",null,"SK33",3298,"1210-0001-P","SP2701-21","SP1002-02",10538,"SP1003-09","SP2701-21","SP2600-07",null,null,3277,7883,3992,"3284-200"]
["3370-200",40,"3/4\" BSP","Flange","9970-200","SK33",3298,"1210-0001-P","SP2701-21","SP1002-02",7876,"SP1003-01","SP2701-21","SP2600-13",null,"SP2600-13",5857,"Assy 7884",3992,"3274-200"]
["3370-201",40,"3/4\" BSP","Flange",null,"SK33",3298,"1210-0001-P","SP2701-21","SP1002-02",10538,"SP1003-09","SP2701-21","SP2600-13",null,"SP2600-13",5857,7883,3992,"3274-201"]
["3370-221",40,"3/4\" BSP","Flange",null,"SK33",3298,"1210-0001-P","SP2701-21","SP1002-02",7876,"SP1003-01","SP2701-21","SP2600-13",null,"SP2600-13","3277-21","Assy 7884",3992,"3274-200"]
["3370-241",40,"3/4\" BSP","Flange",null,"SK33",3298,"1210-0001-P","SP2701-21","SP1002-02",10538,"SP1003-09","SP2701-21","SP2600-13",null,"SP2600-13",5857,7883,3992,"3274-200"]
["3370-251",40,"3/4\" BSP","Flange","9970-261","SK33",3298,"1210-0001-P","SP2701-21","SP1002-02","Assy 7884","SP1003-01","SP2701-21","SP2600-13",null,"SP2600-13",9647,"Assy 7884",3992,"3274-251"]
["3370-271",40,"3/4\" BSP","Flange",null,"SK33",3298,"1210-0001-P","SP2701-21","SP1002-02","Assy 7884","SP1003-01","SP2701-21","SP2600-13",null,"SP2600-13",5857,"Assy 7884",3992,"3274-200"]
["3380-0001",40,"1/2\" NPT","Flange",null,"90033-0001","5212-0000","1210-0001-P","92700-0060","91002-0020","5211-0000","91003-0090","92700-0060","92600-0130",null,"92600-0130","5857-0000",null,"11830-0000","3384-0000"]
["3380-200",40,"3/4\" BSP","Flange","9970-200","SK33",3298,"1210-0001-P","SP2701-21","SP1002-02","Assy 5211","SP1003-07","SP2701-21","SP2600-13",null,"SP2600-13",5857,"Assy 5211",3992,3384]
["3380-221",40,"1/2\" BSP","Flange","9970-200","SK33",3298,"1210-0001-P","SP2701-21","SP1002-02","Assy 5211","SP1003-07","SP2701-21","SP2600-13",null,"SP2600-13",9647,"Assy 5211",3992,3384]
["3570-0001",200,"1-1/2\"\nFlanged","Flange",null,"90019-0001","816-0000","17935-0001-P","6408-0000","91095-0060","7256-0000","91005-0040","818-0000","92600-0040",null,null,"3577-0000","2574-0000","12062-0000","Obsolete"]
["3590-9001",80,"1-3/4\"\nFlanged","Flange",null,"90118-0001","2432-0000","17937-0001-P","96080-0080","91003-0010","7957-0000","91004-0090","92700-0200","92600-0060",null,null,"Obsolete","7957-0000","Obsolete","Obsolete"]
["3890-9011",40,"3/4\" NPT","Foot",null,"90111-0011","3298-0000","1210-0001-P","96080-0080","91000-0020","7884-0000","91003-0010","92700-0180","92600-0070",null,null,"3897-9000","7884-0000","11831-0000","3894-0010"]
["42730-0000",120,"1\" NPT","Foot",null,"90124-0001","18753-0330","18948-0001-P","96080-0080","18753-0332","42737-1000","18753-0332",null,null,null,null,"42739-1000","4156-0000","42738-1000","42734-1000"]
["43210-0001",40,"1\" Hose","Flange","Cooling","90134-0001",null,"3085-0001-P",null,null,"490-0000",null,null,null,null,null,null,null,null,"10194-0000"]
["43210-0001",80,"1-1/4\"\nHose","Flange",null,"90196-0001","43205-1000","17954-0001-P","18753-0328","18753-0314","43176-1000",null,null,"18753-0318",null,"18753-0318","43207-1000","43176-1000","43208-1000","43209-1000"]
["4330-01",80,"0 32 Hose/ Flange","Flange",null,null,null,"-P"]
["4530-0001",10,"1/4\" NPT","Foot",null,"90001-0001","1126-0000","4528-0001-P","4539-0000","91002-0010","4538-0000","91002-0020",null,null,null,null,"4537-0000",null,"11835-0000","4534-0000"]
["4530-0003",10,"1/4\" NPT","Foot",null,"90001-0003","1126-0000","4528-0003-P","4539-0000","91002-0010","4538-0000","91002-0020",null,null,null,null,"4537-0000",null,"11835-0000","4534-0000"]
["4540-0001",20,"3/8\" NPT","Foot",null,"90002-0001","2995-0000","4527-0001-P","4549-0000","91002-0010","2907-0000","91002-0020",null,null,null,null,"4547-0000",null,"11830-0000","4544-0000"]
["4540-0003",20,"3/8\" NPT","Foot",null,"90002-0003","2995-0000","4527-0003-P","4549-0000","91002-0010","2907-0000","91002-0020",null,null,null,null,"4547-0000",null,"11830-0000","4544-0000"]
["4560-0001",40,"1/2\" NPT","Foot",null,"90003-0001","7083-0000","4568-0001-P","3791-0000","91002-0020","490-0001","91003-0070",null,null,null,null,"4567-0000",null,"4565-0000","4564-0000"]
["4560-0003",40,"1/2\" NPT","Foot",null,"90003-0003","7083-0000","4568-0003-P","3791-0000","91002-0020","490-0001","91003-0070",null,null,null,null,"4567-0000",null,"4565-0000","4564-0000"]
["4590-0001",80,"3/4\" NPT","Foot",null,"90004-0001","706-0010","4598-0001-P","3791-0000","91003-0010","17612-0000","91004-0010",null,null,null,null,"4597-0000",null,"4595-0000","4594-0000"]
["4590-0003",80,"3/4\" NPT","Foot",null,"90004-0003","706-0010","4598-0003-P","3791-0000","91003-0010","17612-0000","91004-0010",null,null,null,null,"4597-0000",null,"4595-0000","4594-0000"]
["4620-0001",80,"1\" NPT","Foot",null,"90004-0001","706-0010","4598-0001-P","3791-0000","91003-0010","17612-0000","91004-0010",null,null,null,null,"4597-0000",null,"4595-0000","4624-0000"]
["4620-0003",80,"1\" NPT","Foot",null,"90004-0003","706-0010","4598-0003-P","3791-0000","91003-0010","17612-0000","91004-0010",null,null,null,null,"4597-0000",null,"4595-0000","4624-0000"]
["47070-2001",70,"3/4\" BSP","Foot",null,null,"X4020-369F","31070-0051-P","SP6080- 0469","X3001-078F","47072-0000","X3004-074F","SP2700-1027","SP2600-12",null,"SP2600-12","47077-0000",4156,"47075-0000","47074-2000"]
["47100-2001",100,"1\" BSP","Foot",null,null,"X4020-389A","31100-0061-P","X5280-008","X3001-178F","47102-0000","X3001-178F","X5280-009","SP2601- 0468",null,"SP2601- 0468","47107-0000","47106-0000","47105-0000","47104-2000"]
["47300-2001",300,"2\" BSP","Foot",null,null,"X4020-399A","31300-0051-P",21849,"X3001-178F","47302-0000","X3001-205F","SP2701-54","SP2601- 0458",null,"SP2601- 0458","47307-0000","47306-0000","47305-0000","47304-2000"]
["4760-01",20,"3/4\" BSP","Flange",null,"SK228","2995-0030","673-0001-P","SP2701-04","SP1002-01",4454,"SP1002-09",null,null,null,null,4998,4466,3992,4764]
["4760-101",20,"3/4\" BSP","Flange",null,"SK228","2995-0030","673-0001-P","SP2701-04","SP1002-01",4454,"SP1002-09",null,null,null,null,"4766-101",4466,3992,"4764-41"]
["4760-111",20,"3/4\" BSP","Flange",null,"SK228","2995-0030","673-0001-P","SP2701-04","SP1002-01",4454,"SP1002-09",null,null,null,null,"4766-111",4466,3992,4764]
["4760-141",20,"3/4\" BSP","Flange",null,"SK228","2995-0030","673-0001-P","SP2701-04","SP1002-01",4454,"SP1002-09",null,null,null,null,"4766-141",4466,3992,"4764-41"]
["4760-151",20,"3/4\" BSP","Flange",null,"SK228","2995-0030","673-0001-P","SP2701-04","SP1002-01",4454,"SP1002-09",null,null,null,null,"4766-151",4466,3992,4764]
["4760-21",20,"3/4\" BSP","Flange",null,"SK228","2995-0030","673-0001-P","SP2701-04","SP1002-01",4454,"SP1002-09",null,null,null,null,"4766-21",4466,3992,4764]
["4760-41",20,"1/2\" BSP","Flange",null,"SK228","2995-0030","673-0001-P","SP2701-04","SP1002-01",4454,"SP1002-09",null,null,null,null,4766,4466,3992,"4764-41"]
["4760-51",20,"3/4\" BSP","Flange",null,"SK228","2995-0030","673-0001-P","SP2701-04","SP1002-01",4454,"SP1002-09",null,null,null,null,4766,4466,3992,"4764-41"]
["4760-61",20,"3/4\" BSP","Flange",null,"SK228","2995-0030","673-0001-P","SP2701-04","SP1002-01",4454,"SP1002-09",null,null,null,null,"4767-61",4466,3992,"4764-41"]
["4760-71",20,"3/4\" BSP","Flange",null,"SK228","2995-0030","673-0001-P","SP2701-04","SP1002-01",4454,"SP1002-09",null,null,null,null,"4766-71",4466,3992,"4764-71"]
["4760-81",20,"3/4\" BSP","Flange",null,"SK228","2995-0030","673-0001-P","SP2701-04","SP1002-01",4454,"SP1002-09",null,null,null,null,"4766-81",4466,3992,4674]
["4760-91",20,"1/2\" BSP","Flange",null,"SK228","2995-0030","673-0001-P","SP2701-04","SP1002-01",4454,"SP1002-09",null,null,null,null,"4766-91",4466,3992,4674]
["4800-101",200,"1-1/2\"\nFlanged","Flange",null,"SK230",816,"836-0001-P",21849,"SP1005-04",2551,"SP1005-05","SP2700-51",null,null,"SP2600-03","4338-07",2574,9336,"4804-01"]
["4800-111",200,"1-1/2\"\nFlanged","Flange",11790,"SK230",816,"836-0001-P",21849,"SP1005-04",834,"SP1005-04","SP2700-51",null,null,"SP2600-03","4338-07",2574,9336,"4804-01"]
["4800-161",200,"1-1/2\"\nFlanged","Flange",null,"SK230",816,"836-0001-P",21849,"SP1005-04",834,"SP1005-04","SP2700-51",null,null,"SP2600-03",4388,2574,"4807-161","4804-01"]
["4800-171",200,"1-3/4\"\nFlanged","Flange",null,"SK230",816,"836-0001-P",21849,"SP1005-04",2551,"SP1005-05","SP2700-51",null,null,"SP2600-03",4388,2574,"4807-181",4804]
["4800-21",200,"1-1/2\" BSP","Flange","4800-21-\n01","SK230",816,"836-0001-P",21849,"SP1005-04",2551,"SP1005-05","SP2700-51",null,null,"SP2600-18","4388-07",2574,9336,4804]
["4800-21-01",200,"1-1/2\"\nFlanged","Flange",null,"SK230",816,"836-0001-P",21849,"SP1005-04",2551,"SP1005-05","SP2700-51",null,null,"SP2600-18","4388-07",2574,9336,4804]
["4800-41",200,"1-3/4\"\nFlanged","Flange",null,"SK230",816,"836-0001-P",21849,"SP1005-04",834,"SP1005-04","SP2700-51",null,null,"SP2600-18","4388-07",2574,9336,4804]
["4800-51",200,"1-1/2\"\nFlanged","Flange",null,"SK230",816,"836-0001-P",21849,"SP1005-04",2551,"SP1005-05","SP2700-51",null,null,"SP2600-18",4388,2574,"4807-51","4804-01"]
["4800-53",200,"1-3/4\"\nFlanged","Flange",null,"SK230",816,"836-0001-P",21849,"SP1005-04",834,"SP1005-04","SP2700-51",null,null,"SP2600-03","4388-53",2574,9336,"4804-01"]
["4800-54",200,"1-1/2\"\nFlanged","Flange",null,"SK230",816,"836-0001-P",21849,"SP1005-04",834,"SP1005-04","SP2700-51",null,null,"SP2600-18","4388-07",2574,9336,"4804-01"]
["4800-71",200,"1-1/2\"\nFlanged","Flange",null,"SK230",816,"836-0001-P",21849,"SP1005-04",834,"SP1005-04","SP2700-51",null,null,"SP2600-03","4388-07",2574,9336,"4804-01"]
["4900-01",40,"1/2\" BSP","Foot",null,"SK234",4908,"4568-0001-P",3791,"SP1003-09",4906,"SP1003-07",null,null,null,null,"C10",null,4905,4904]
["4900-200",40,"1/2\" BSP","Foot",null,"SK234",4908,"4568-0001-P",3791,"SP1003-09",490,"SP1003-07",null,null,null,null,"C10-01",null,4905,"4904-200"]
["4900-201",40,"1/2\" BSP","Foot",null,"SK234",4908,"4568-0001-P",3791,"SP1003-09",490,"SP1003-07",null,null,null,null,"C10-01",null,4905,"4904-200"]
["4900-205",40,"1/2\" BSP","Foot",null,"SK234",4908,"4568-0001-P",3791,"SP1003-09",10336,"SP1003-10",null,null,null,null,"C10-01",null,4905,"4904-200"]
["4900-237",40,"1/2\" BSP","Foot",null,"SK234-37",4908,"4568-0003-P",3791,"SP1003-09",490,"SP1003-07",null,null,null,null,"C10-01",null,4905,"4904-200"]
["50080-2001",80,"1\" BSP","Foot",null,"SK406-0001",890,"17937-0001-P","SP2700-1027","X3001-147F","934-0000","SP1004-09","SP2700-48","SP2600-06",null,null,"50087-0000",4156,3993,"50084-2000"]
["50080-2003",80,"1\" BSP","Foot",null,"SK406-0003",890,"17937-0003-P","SP2700-1027","X3001-147F","934-0000","SP1004-09","SP2700-48","SP2600-06",null,null,"50087-0000",4156,3993,"50084-2000"]
["50080-2101",80,"1\" BSP","Foot",null,"SK406-0001",890,"17937-0001-P","SP2700-1027","X3001-147F","934-0000","SP1004-09","SP2700-48","SP2600-06",null,null,"50087-0000",4156,3993,"50084-2000"]
["50080-2103",80,"1\" BSP","Foot",null,"SK406-0003",890,"17937-0003-P","SP2700-1027","X3001-147F","934-0000","SP1004-09","SP2700-48","SP2600-06",null,null,"50087-0000",4156,3993,"50084-2000"]
["50080-2201",80,"1\" BSP","Foot",null,"SK406-0001",890,"17937-0001-P","SP2700-1027","X3001-147F","934-0000","SP1004-09","SP2700-48","SP2600-06",null,null,"50087-0000",4156,3993,"50084-2000"]
["50080-2203",80,"1\" BSP","Foot",null,"SK406-0003",890,"17937-0003-P","SP2700-1027","X3001-147F","934-0000","SP1004-09","SP2700-48","SP2600-06",null,null,"50087-0000",4156,3993,"50084-2000"]
["50080-2301",80,"1\" BSP","Foot",null,"SK406-0001",890,"17937-0001-P","SP2700-1027","X3001-147F","934-0000","SP1004-09","SP2700-48","SP2600-06",null,null,"50087-0000",4156,3993,"50084-2000"]
["50080-2303",80,"1\" BSP","Foot",null,"SK406-0003",890,"17937-0003-P","SP2700-1027","X3001-147F","934-0000","SP1004-09","SP2700-48","SP2600-06",null,null,"50087-0000",4156,3993,"50084-2000"]
["50080-2321",80,"1\" BSP","Foot",null,"SK406-0001",890,"17937-0001-P","SP2700-1027","X3001-147F","934-0000","SP1004-09","SP2700-48","SP2600-06",null,null,"50087-0000",4156,3993,"50084-2000"]
["50080-2903",80,"1\" BSP","Foot",null,"SK406-0003",890,"17937-0003-P","SP2700-1027","X3001-147F","934-0000","SP1004-09","SP2700-48","SP2600-06",null,null,"50087-0000",4156,3993,"50084-2000"]
["50190-1001",40,"0 32 Hose","Flange",null,null,3298,"1210-0001-P","SP2700-1027","X3001-095F",490,"SP1003-01",null,"SP2601-0451",null,null,"50197-0000",null,3992,"50194-1000"]
["50200-2003",200,"1-1/2\" BSP","Foot",null,"SK407-0003",816,"836-0003-P",21849,"X3001-176F",834,"SP1005-04","SP2700-50","SP2600-04",null,null,"50207-0000",2574,9336,"50204-2000"]
["50200-2011",200,"1-1/2\" BSP","Foot",null,"SK407-0011",816,"17935-0001-P",21849,"X3001-176F",834,"SP1005-04","SP2700-50","SP2600-04",null,null,"50207-0000",2574,9336,"50204-2000"]
["50200-2103",200,"1-1/2\" BSP","Foot",null,"SK407-0003",816,"836-0003-P",21849,"X3001-176F",834,"SP1005-04","SP2700-50","SP2600-04",null,null,"50207-0000",2574,9336,"50204-2000"]
["50200-2111",200,"1-1/2\" BSP","Foot",null,"SK407-0011",816,"17935-0001-P",21849,"X3001-176F",834,"SP1005-04","SP2700-50","SP2600-04",null,null,"50207-0000",2574,9336,"50204-2000"]
["50200-2203",200,"1-1/2\" BSP","Foot",null,"SK407-0003",816,"836-0003-P",21849,"X3001-176F",834,"SP1005-04","SP2700-50","SP2600-04",null,null,"50207-0000",2574,9336,"50204-2000"]
["50200-2211",200,"1-1/2\" BSP","Foot",null,"SK407-0011",816,"17935-0001-P",21849,"X3001-176F",834,"SP1005-04","SP2700-50","SP2600-04",null,null,"50207-0000",2574,9336,"50204-2000"]
["50200-2303",200,"1-1/2\" BSP","Foot",null,"SK407-0003",816,"836-0003-P",21849,"X3001-176F",834,"SP1005-04","SP2700-50","SP2600-04",null,null,"50207-0000",2574,9336,"50204-2000"]
["50200-2311",200,"1-1/2\" BSP","Foot",null,"SK407-0011",816,"17935-0001-P",21849,"X3001-176F",834,"SP1005-04","SP2700-50","SP2600-04",null,null,"50207-0000",2574,9336,"50204-2000"]
["50200-2903",200,"1-1/2\" BSP","Foot",null,"SK407-0003",816,"836-0003-P",21849,"X3001-176F",834,"SP1005-04","SP2700-50","SP2600-04",null,null,"50207-0000",2574,9336,"50204-2000"]
["50200-9203",200,"1-1/2\" BSP","Foot",null,"SK407-0003",816,"836-0003-P",21849,"X3001-176F",834,"SP1005-04","SP2700-50","SP2600-04",null,null,"50207-0000",2574,9336,"50204-2000"]
["50200-9303",200,"1-1/2\" BSP","Foot",null,"SK407-0003",816,"836-0003-P",21849,"X3001-176F",834,"SP1005-04","SP2700-50","SP2600-04",null,null,"50207-0000",2574,9336,"50204-2000"]
["50200-9403",200,"1-1/2\" BSP","Foot",null,"SK407-0003",816,"836-0003-P",21849,"X3001-176F",834,"SP1005-04","SP2700-50","SP2600-04",null,null,"50207-0000",2574,9336,"50204-2000"]
["50210-1001",80,"Clamp","Flange",null,null,890,"17937-0001-P","SP2700-1027","X3001-147F","934-0000","SP1004-09",null,"SP2600- 0500",null,"SP2600- 0500","50217-0000",4156,3993,"50214-2000"]
["50210-1101",80,"Clamp","Flange",null,null,"X4020-269A","17937-0001-P","SP2700-1027","X3001-147F","53082-0000","X3004-174F",null,"SP2600- 0500",null,"SP2600- 0500","50217-0200",4156,"50215-0000","50214-1100"]
["50220-0011",200,"1-1/2\"\nFlanged","Foot",null,"SK407-0011",816,"17935-0001-P",21849,"SP1095- 0640",834,"SP1005-04","SP2701-54","SP2601- 0458",null,"SP2601- 0458","50227-0000",2574,9336,"10634-02"]
["50220-0111",200,"1-1/2\"\nFlanged","Foot",null,"SK407-0011",816,"17935-0001-P",21849,"SP1095- 0640",834,"SP1005-04","SP2701-54","SP2601- 0458",null,"SP2601- 0458","50227-0000",2574,9336,"10634-02"]
["50220-0211",200,"1-1/2\"\nFlanged","Foot",null,"SK407-0011",816,"17935-0001-P",21849,"SP1095- 0640",834,"SP1005-04","SP2701-54","SP2601- 0458",null,"SP2601- 0458","50227-0000",2574,9336,"10634-02"]
["50220-0311",200,"1-1/2\"\nFlanged","Foot",null,"SK407-0011",816,"17935-0001-P",21849,"SP1095- 0640",834,"SP1005-04","SP2701-54","SP2601- 0458",null,"SP2601- 0458","50227-0000",2574,9336,"10634-02"]
["50220-0903",200,"1-1/2\"\nFlanged","Foot",null,"SK407-0003",816,"836-0003-P",21849,"SP1095- 0640",834,"SP1005-04","SP2701-54","SP2601- 0458",null,"SP2601- 0458","50227-0000",2574,9336,"10634-02"]
["50230-0311",200,"1-1/2\"\nFlanged","Foot",null,"SK407-0011",816,"17935-0001-P",21849,"SP1095- 0640",834,"SP1005-04","SP2701-54","SP2601- 0458",null,"SP2601- 0458","50227-0000",2574,9336,10584]
["50260-2041",80,"1\" BSP","Flange",null,"SK385-0001",890,"17937-0001-P","SP2700-1027","SP1003-0111",3255,"SP1004-11","SP2700-1027","SP2600-01",null,"SP2600-01","50267-0000",4156,3993,"50264-2000"]
["50270-0011",270,"2\" Flanged","Foot",null,"SK408-0011",816,"17936-0001-P",21849,"SP1095- 0640",6988,"SP1005-04","SP2701-54","SP2601- 0458",null,"SP2601- 0458","50227-0000",2574,9336,"10634-02"]
["50270-0111",270,"2\" Flanged","Foot",null,"SK408-0011",816,"17936-0001-P",21849,"SP1095- 0640",6988,"SP1005-04","SP2701-54","SP2601- 0458",null,"SP2601- 0458","50227-0000",2574,9336,"10634-02"]
["50270-0211",270,"2\" Flanged","Foot",null,"SK408-0011",816,"17936-0001-P",21849,"SP1095- 0640",6988,"SP1005-04","SP2701-54","SP2601- 0458",null,"SP2601- 0458","50227-0000",2574,9336,"10634-02"]
["50270-0311",270,"2\" Flanged","Foot",null,"SK408-0011",816,"17936-0001-P",21849,"SP1095- 0640",6988,"SP1005-04","SP2701-54","SP2601- 0458",null,"SP2601- 0458","50227-0000",2574,9336,"10634-02"]
["50270-0911",270,"2\" Flanged","Foot",null,"SK408-0011",816,"17936-0001-P",21849,"SP1095- 0640",6988,"SP1005-04","SP2701-54","SP2601- 0458",null,"SP2601- 0458","50227-0000",2574,9336,"10634-02"]
["50270-0913",270,"2\" Flanged","Foot",null,"SK408-0013",816,"6760-0003-P",21849,"SP1095- 0640",6988,"SP1005-04","SP2701-54","SP2601- 0458",null,"SP2601- 0458","50227-0000",2574,9336,"10634-02"]
["50270-2011",270,"2\" BSP","Foot",null,"SK408-0011",816,"17936-0001-P",21849,"SP1095- 0640",6988,"SP1005-04","SP2701-54","SP2601- 0458",null,"SP2601- 0458","50227-0000",2574,9336,"10634-02"]
["50270-2111",270,"2\" BSP","Foot",null,"SK408-0011",816,"17936-0001-P",21849,"SP1095- 0640",6988,"SP1005-04","SP2701-54","SP2601- 0458",null,"SP2601- 0458","50227-0000",2574,9336,"10634-02"]
["50270-2211",270,"2\" BSP","Foot",null,"SK408-0011",816,"17936-0001-P",21849,"SP1095- 0640",6988,"SP1005-04","SP2701-54","SP2601- 0458",null,"SP2601- 0458","50227-0000",2574,9336,"10634-02"]
["50270-2311",270,"2\" BSP","Foot",null,"SK408-0011",816,"17936-0001-P",21849,"SP1095- 0640",6988,"SP1005-04","SP2701-54","SP2601- 0458",null,"SP2601- 0458","50227-0000",2574,9336,"10634-02"]
["50270-2313",270,"2\" BSP","Foot",null,"SK408-0013",816,"6760-0003-P",21849,"SP1095- 0640",6988,"SP1005-04","SP2701-54","SP2601- 0458",null,"SP2601- 0458","50227-0000",2574,9336,"10634-02"]
["50270-2911",270,"2\" BSP","Foot",null,"SK408-0011",816,"17936-0001-P",21849,"SP1095- 0640",6988,"SP1005-04","SP2701-54","SP2601- 0458",null,"SP2601- 0458","50227-0000",2574,9336,"10634-02"]
["50270-2913",270,"2\" BSP","Foot",null,"SK408-0013",816,"6760-0003-P",21849,"SP1095- 0640",6988,"SP1005-04","SP2701-54","SP2601- 0458",null,"SP2601- 0458","50227-0000",2574,9336,"10634-02"]
["50280-2001",40,"3/4\" BSP","Flange",null,"SK271",3298,"1210-0001-P","SP2701-21","SP1002-02",7876,"SP1003-01","SP2701-21","SP2601-07",null,null,3277,7883,3992,"3274-200"]
["50280-2101",40,"3/4\" BSP","Flange",null,"SK271",3298,"1210-0001-P","SP2701-21","SP1002-02",7876,"SP1003-01","SP2701-21","SP2601-07",null,null,3277,7883,3992,"3274-200"]
["50310-1001",80,"0  32 Hose","Flange",null,null,"X4020-354A","17937-0001-P","SP6080- 0469","X3001-209F","934-0000","SP1004-09","SP2700-1027","SP2600- 0500",null,"SP2600- 0500","50317-0000",4156,3993,"29604-1700"]
["50310-1101",80,"0 32 Hose","Flange",null,null,"X4020-354A","17937-0001-P","SP6080- 0469","SP1003-0111","934-0000","SP1004-09","SP2700-1027","SP2600- 0500",null,"SP2600- 0500","29609-0100",4156,3993,"29604-1300"]
["50310-1251",80,"0  32 Hose","Flange",null,null,"X4020-354A","17937-0001-P","SP6080- 0469","SP1003-0111",2431,"SP1004-10","SP2700-1027","SP2600- 0500",null,"SP2600- 0500","29609-0200",4156,3993,"29604-1300"]
["50320-2001",80,"1\" BSP","Foot",null,null,890,"17937-0001-P","SP2700-1027","X3001-147F","934-0000","SP1004-09","Not Fitted","SP2600-12",null,"SP2600-12","50327-0000","Not Fitted",3993,"50324-2000"]
["50340-1001",40,"0 28 Hose","Flange",null,"SK384-0001",3298,"1210-0001-P","SP2700-1027","X3004-095G",490,"SP1003-01","SP2700-1027","SP2601-0451",null,"SP2601-0451","50347-0000",7883,3992,"50344-1000"]
["50350-1001",120,"0  45 Hose","Flange",null,null,"X4020-269A","17018-0001-P","SP6080- 0469","X3001-176F","23341-0001","SP1004-09","SP2701-0903","SP2600-11",null,"SP2600-11","50357-0000",4156,"50355-0000","50354-1000"]
["50360-1001",40,"0 28 Hose","Flange",null,null,"X4020-259A","1210-0001-P","SP6080- 0469","X3001-147F","490-0100","SP1003-01","SP2700-1027","SP2601-0451",null,"SP2601-0451","50367-0000",7883,"23825-0000","50364-1000"]
["50370-1001",40,"0 28 Hose","Flange","50370-\n2001",null,"X4020-259A","1210-0001-P","SP6080- 0469","X3001-147F","23826-0000","SP1003-01","SP2700-1027","SP2601-0451",null,"SP2601-0451","50377-0000",7883,"23825-0000","50374-1000"]
["50370-2001*",40,"0 28 Hose","Flange",null,null,"X4020-259A","1210-0001-P","SP6080- 0469","X3001-147F","23826-0000","SP1003-01","SP2700-1027","SP2601- 0451H",null,"SP2601- 0451H","50377-0000",7883,"23825-0000","50374-2000"]
["50380-1001*",80,"0  38/45\nHose","Flange",null,null,"X5251-052","17937-0001-P","SP6080- 0469","X3001-178F","53082-0000","X3003-176F",null,"92600-0518",null,"92600-0518","50387-0000",4156,"50386-1000","50384-1000"]
["50390-1201*",120,"0  45/50\nHose","Flange",null,null,"X5251-052","17018-0001-P","SP6080- 0469","X3001-178F","50392-0100","X3003-176F",null,"92600-0518",null,"92600-0518","50397-0100",4156,"50396-1000","50394-1300"]
["50400-1001",40,"0 28 Hose","Flange",null,"SK384-0001",3298,"1210-0001-P","SP2700-1027","SP1002-02",490,"SP1003-01","SP2700-1027","SP2601-0451",null,"SP2601-0451","50407-0000",7883,3992,"29504-1200"]
["50410-1201",60,"0 32 Hose","Crank",null,null,"92000-1403","18777-0001-P","SP2701-21","X3001-151F","22318-0100","X3003-149K",null,"SP2600-12",null,"SP2600-12","22113-6000",null,"50416-0000","50414-1000"]
["50410-1251",60,"0  32 Hose","Crank",null,null,"92000-1403","18777-0001-P","SP2701-21","X3001-151F","22308-0100","X3002-147F",null,"SP2600-12",null,"SP2600-12","22113-6000",null,"50416-0000","50414-1000"]
["50410-1301",60,"0 32 Hose","Crank",null,null,"92000-1403","18777-0001-P","96080-6080","X3001-151F","22318-0100","X3003-149K",null,"SP2600-12",null,"SP2600-12","22113-6000",null,"50416-0000","50414-1000"]
["50410-1351",60,"0 32 Hose","Crank",null,null,"92000-1403","18777-0001-P","96080-6080","X3001-151F","22308-0100","X3002-147F",null,"SP2600-12",null,"SP2600-12","22113-6000",null,"50416-0000","50414-1000"]
["50410-1401",60,"0  32 Hose","Crank",null,null,"92000-1403","18777-0001-P","SP2701-21","X3001-151F","22318-0100","X3002-147K",null,"SP2600-12",null,"SP2600-12","22113-6000",null,"50416-0000","50414-1000"]
["50410-1501",60,"0 32 Hose","Crank",null,null,"92000-1403","18777-0001-P","96080-6080","X3001-151F","22318-0100","X3003-149K",null,"SP2600-12",null,"SP2600-12","22113-6000",null,"50416-0000","50414-1000"]
["50430-0301*",120,"Hose/ Flange","Flange",null,null,"X4020-269A","17018-0001-P","SP6080- 0469","X3001-176F","50392-0000","X3003-176F",null,"SP2600-32",null,"SP2600-32","50437-0100",4156,"50355-0000","50434-0000"]
["50440-1401*",80,"0  32 Hose","Flange",null,"SK385-0601","X4020-269A","920-0001-P","SP6080- 0469","X3001-176F","53082-0000","X3003-176F","SP2700-1027","SP2601- 0468",null,"SP2601- 0468","29637-0100",4156,"50355-0000","50444-1000"]
["50500-0001*",300,"Flange","Flange",null,null,"X4020-399A","17938-0001-P",21849,"X3001-176F","29838-0000","X3003-176F","SP2701-54","SP2601-37",null,"SP2601-37","50507-0000",2574,"29825-0400","50504-1000"]
["50530-0001*",80,"Hose/ Flange","Flange",null,null,"X4020-269A","17937-0001-P","96080-0626","X3001-178F","53082-0040","X3003-174F","SP2701-54","SP2601-37",null,"SP2601-37","50537-0000",4156,"50355-0000","50534-0000"]
["50540-1001*",120,"0  45 Hose","Flange",null,null,"X4020-269A","920-0001-P","SP6080- 0469","X3001-176F","53092-0000","X3003-176F","SP2700- 0903","SP2600-11",null,"SP2600-11","50547-0000",4156,"50355-0000","50544-1000"]
["50570-0001*",300,"Flange","Flange",null,null,"X4020-399A","836-0001-P",21849,"X3001-176F","29838-0000","X3001-205F","SP2701-54","SP2601-37",null,"SP2601-37","50577-0000",2574,"29825-0500","50504-1100"]
["50590-0001*",200,"Hose/ Flange","Flange",null,null,"X4020-399A","836-0001-P",21849,"X3001-178F","52238-0000","X3003-178F","SP2700-50","SP2600-32",null,"SP2600-32","50597-0000",2574,"29825-0600","50594-0000"]
["50680-0031*",300,"Flange","Flange",null,null,"X4020-399A","17938-0001-P",21849,"X3001-176F","29838-0010","X3001-203F",null,"SP2601- 0469",null,"SP2601-40","50687-0000",2754,"50685-0000","29834-0100"]
["51080-2001",80,"1\" BSP","Foot",null,"SK406-0001",890,"17937-0001-P","SP2700-1027","X3001-147F","934-0000","SP1004-09","SP2700-48","SP2600-06",null,"SP2600-11","51087-0000",4156,3993,"50084-2100"]
["51080-2003",80,"1\" BSP","Foot","51080-\n2001","SK406-0003",890,"17937-0003-P","SP2700-1027","X3001-147F","934-0000","SP1004-09","SP2700-48","SP2600-06",null,"SP2600-11","51087-0000",4156,3993,"50084-2100"]
["51080-2041",80,"1\" BSP","Foot",null,"SK406-0001",890,"17937-0001-P","SP2700-1027","X3001-147F","934-0000","SP1004-09","SP2700-48","SP2600-06",null,"SP2600-11","51087-0000",4156,3993,"50084-2100"]
["51080-9013",80,"1\" NPT","Foot",null,null,890,"920-0003-P","SP2700-1027","X3001-147F",null,"SP1004-09","SP2700-48","SP2600-06",null,"SP2600-11","51087-0000",4156,3993,"50084-9100"]
["51200-2003",200,"1-1/2\" BSP","Foot","Bilge Option","SK407-0003",816,"836-0003-P",21849,"X3001-176F",834,"SP1005-04","SP2700-50","SP2600-04",null,"SP2600-09","51207-0000",2574,9336,"50204-2100"]
["51200-2011",200,"1-1/2\" BSP","Foot","Bilge Option","SK407-0011",816,"17935-0001-P",21849,"X3001-176F",834,"SP1005-04","SP2700-50","SP2600-04",null,"SP2600-09","51207-0000",2574,9336,"50204-2100"]
["51200-9013",200,"1-1/2\" NPT","Foot",null,null,816,"836-0003-P",21849,"X3001-176F",834,"SP1005-04","SP2700-50","SP2600-04",null,"SP2600-09","51207-0000",2574,9336,"50204-9100"]
["51220-0011",200,"1-1/2\"\nFlanged","Foot",null,"SK407-0011",816,"17935-0001-P",21849,"X3001-176F",834,"SP1005-04","SP2700-50","SP2600-04",null,"SP2600-09","51207-0000",2574,9336,10634]
["51270-0011",270,"2\" Flanged","Foot",null,"SK408-0011",816,"21676-0001-P",21849,"X3001-176F",6988,"SP1005-04","SP2701-54","SP2601- 0458",null,"SP2600-09","51277-0000",2574,9336,10494]
["51270-2011",270,"2\" BSP","Foot",null,"SK408-0011",816,"21676-0001-P",21849,"X3001-176F",6988,"SP1005-04","SP2701-54","SP2601- 0458",null,"SP2600-09","51277-0000",2574,9336,"50204-2100"]
["51270-2013",270,"2\" BSP","Foot",null,"SK408-0013",816,"21676-0003-P",21849,"X3001-176F",6988,"SP1005-04","SP2701-54","SP2601- 0458",null,"SP2600-09","51277-0000",2574,9336,"50204-2100"]
["51270-9013",270,"2\" NPT","Foot",null,null,816,"6760-0003-P",21849,"X3001-176F",6988,"SP1005-04","SP2701-54","SP2601- 0458",null,"SP2600-09","51277-0000",2574,9336,"50274-0000"]
["51510-2001",10,"3/8\" BSP","Foot",null,null,"X4020-244A","22405-0001-P","96080-6024","X3001-095F","Not Fitted","Not Fitted",null,"SP2601- 0457",null,"SP2601- 0457","51517-0000","Not Fitted","29305-0100","51514-2000"]
["51520-2001",20,"3/8\" BSP","Foot",null,null,"X5251-050","653-0001-P","96080-6024","X3001-174F","Not Fitted","Not Fitted",null,"SP2601- 0457",null,"SP2601- 0457","51527-0000","Not Fitted","29405-0000","51524-2000"]
["52010-0051",10,"3/8\" NPT","Foot",null,"SK404-0101","29308-0000","22405-0001-P","SP2701-0501","X3001-095F",null,null,"SP2701-1006","SP2601- 0457","SP2701-1006","SP2601- 0457","52017-0000","29306-0000","29305-0000","52014-2000"]
["52010-2001",10,"3/8\" BSP","Foot","51510-\n2001","SK404-0101","29308-0000","22405-0001-P","SP2701-0501","X3001-095F","29303-0000","SP1009-05","SP2701-1006","SP2601- 0457","SP2701-1006","SP2601- 0457","52017-0000","29306-0000","29305-0000","52014-2000"]
["52010-2051",10,"3/8\" BSP","Foot","51510-\n2001","SK404-0101","29308-0000","22405-0001-P","SP2701-0501","X3001-095F",null,null,"SP2701-1006","SP2601- 0457","SP2701-1006","SP2601- 0457","52017-0000","29306-0000","29305-0000","52014-2000"]
["52020-2001",20,"3/8\" BSP","Foot","51520-\n2001","SK405-0101","2995-0030","18653-0001-P","SP2701-0501","X3001-095F","2907-0001","SP1002-09","SP2701-1006","SP2601- 0457","SP2701-1006","SP2601- 0457","52027-0000",null,3992,"52024-2000"]
["52020-2031",20,"3/8\" BSP","Foot","51520-\n2001","SK405-0101","2995-0030","18653-0001-P","SP2701-0501","X3001-095F","2907-0001","SP1002-09","SP2701-1006","SP2601- 0457","SP2701-1006","SP2601- 0457","52027-0000",null,3992,"52024-2000"]
["52020-2051",20,"3/8\" BSP","Foot","51520-\n2001","SK405-0101","2995-0030","18653-0001-P","SP2701-0501","X3001-095F",2441,"SP1010-06","SP2701-1006","SP2601- 0457","SP2701-1006","SP2601- 0457","52027-0000",null,3992,"52024-2000"]
["52040-2001",40,"3/4\" BSP","Foot",null,"SK384-0101",3298,"1210-0001-P","SP2701-1015","X3001-095F",490,"SP1003-01","SP2700-1027","SP2601-0451","SP2701-1015","SP2601-0451","52047-0000",null,3992,"52044-2000"]
["52040-2003",40,"3/4\" BSP","Foot",null,"SK384-0101",3298,"1210-0003-P","SP2701-1015","X3001-095F",490,"SP1003-01","SP2700-1027","SP2601-0451","SP2701-1015","SP2601-0451","52047-0000",null,3992,"52044-2000"]
["52040-2021",40,"3/4\" BSP","Foot",null,"SK384-0101",3298,"3085-0001-P","SP2701-1015","X3001-095F",490,"SP1003-01","SP2700-1027","SP2601-0451","SP2701-1015","SP2601-0451","52047-0000",null,3992,"52044-2000"]
["52040-2401",40,"3/4\" BSP","Foot",null,"SK384-0101",3298,"1210-0001-P","SP2701-1015","X3001-095F",4906,"SP1003-01","SP2700-1027","SP2601-0451","SP2701-1015","SP2601-0451","52047-0000",null,3992,"52044-2000"]
["52051-2051",40,"3/4\" BSP","Foot",null,"SK384-0101",3298,"1210-0001-P","SP2701-1015","X3001-095F",10336,"SP1003-01","SP2700-1027","SP2601-0451","SP2701-1015","SP2601-0451","52047-0000",null,3992,"52044-2000"]
["52080-2001",80,"1\" BSP","Foot",null,"SK406-0001",890,"17937-0001-P","SP2700-1027","X3001-147F","934-0000","SP1004-09","SP2700-48","SP2600-06","SP2700-1027",null,"52087-0000",4156,3993,"50084-2100"]
["52080-2003",80,"1\" BSP","Foot",null,"SK406-0003",890,"17937-0003-P","SP2700-1027","X3001-147F","934-0000","SP1004-09","SP2700-48","SP2600-06","SP2700-1027",null,"52087-0000",4156,3993,"50084-2100"]
["52080-2021",80,"1\" BSP","Foot",null,"SK406-0021",890,"S91S-0001-P","SP2700-1027","X3001-147F","934-0000","SP1004-09","SP2700-48","SP2600-06","SP2700-1027",null,"52087-0000",4156,3993,"50084-2100"]
["52080-2041",80,"1\" BSP","Foot",null,"SK406-0001",890,"17937-0001-P","SP2700-1027","X3001-147F",null,null,"SP2700-48","SP2600-06","SP2700-1027",null,"52087-0000",4156,3993,"50084-2100"]
["52080-2051",80,"1\" BSP","Foot",null,"SK406-0001",890,"17937-0001-P","SP2700-1027","X3001-147F",2431,"SP1004-10","SP2700-48","SP2600-06","SP2700-1027",null,"52087-0000",4156,3993,"50084-2100"]
["52080-2101",80,"1\" BSP","Foot",null,"SK406-0001",890,"17937-0001-P","SP2700-1027","X3003-178F","934-0000","SP1004-09","SP2700-48","SP2600-06","SP2700-1027",null,"52087-0100",4156,3993,"50084-2200"]
["52200-2001",200,"1-1/2\" BSP","Foot","S2200- 2011","SK407-0011",816,"17935-0001-P",21849,"X3001-176F",834,"SP1005-04","SP2700-50","SP2600-04","SP2701-1013",null,"52207-0000",2574,9336,"50204-2100"]
["52200-2003",200,"1-1/2\" BSP","Foot",null,"SK407-0003",816,"836-0003-P",21849,"X3001-176F",834,"SP1005-04","SP2700-50","SP2600-04","SP2701-1013",null,"52207-0000",2574,9336,"50204-2100"]
["52200-2011",200,"1-1/2\" BSP","Foot",null,"SK407-0011",816,"17935-0001-P",21849,"X3001-176F",834,"SP1005-04","SP2700-50","SP2600-04","SP2701-1013",null,"52207-0000",2574,9336,"50204-2100"]
["52200-2041",200,"1-1/4\" BSP","Foot",null,"SK407-0011",816,"17935-0001-P",21849,"X3001-176F",null,null,"SP2700-50","SP2600-04","SP2701-1013",null,"52207-0000",2574,9336,"50204-2100"]
["52200-2051",200,"1-1/2\" BSP","Foot",null,"SK407-0011",816,"17935-0001-P",21849,"X3001-176F",2551,"SP1005-05","SP2700-50","SP2600-04","SP2701-1013",null,"52207-0000",2574,9336,"50204-2100"]
["52220-0011",200,"1-1/2\"\nFlanged","Foot",null,"SK407-0011",816,"17935-0001-P",21849,"X3001-176F",834,"SP1005-04","SP2701-54","SP2601- 0458","SP2701-1013","SP2601- 0458","52227-0000",2574,9336,10634]
["52220-0041",200,"1-1/2\"\nFlanged","Foot",null,"SK407-0011",816,"17935-0001-P",21849,"X3001-176F",null,null,"SP2701-54","SP2601- 0458","SP2701-1013","SP2601- 0458","52227-0000",2574,9336,10634]
["52220-00S1",200,"1-1/2\"\nFlanged","Flange",null,"SK407-0011",816,"17935-0001-P",21849,"X3001-176F",2551,"SP1005-05","SP2701-54","SP2601- 0458","SP2701-1013","SP2601- 0458","52227-0000",2574,9336,10634]
["52230-0001",200,"1-1/2\"\nFlanged","Flange",null,null,816,"17935-0001-P",21849,"SP109S- 0640",834,"SP1005-04","SP2700-50","SP2600-32",null,null,"21239-0030",2574,9336,"10584-03"]
["52270-0011",270,"2\" Flanged","Foot",null,"SK408-0011",816,"17936-0001-P",21849,"SP1095- 0640",6988,"SP1005-04","SP2701-54","SP2601- 0458","SP2701-1013","SP2601- 0458","52277-0000",2574,9336,10494]
["52270-2011",270,"2\" BSP","Foot",null,"SK408-0011",816,"17936-0001-P",21849,"X3001-176F",6988,"SP1005-04","SP2701-54","SP2601- 0458","SP2701-1013","SP2601- 0458","52277-0000",2574,9336,"50274-2100"]
["52270-2013",270,"2\" BSP","Foot",null,"SK408-0013",816,"6760-0003-P",21849,"X3001-176F",6988,"SP1005-04","SP2701-54","SP2601- 0458","SP2701-1013","SP2601- 0458","52277-0000",2574,9336,"50274-2100"]
["5320-0011",20,"3/8\" NPT","Foot",null,"90044-0001","2995-0000","5616-0001-P","92700-0420","91002-0020","7895-0000","91002-0090",null,null,null,null,"6020-0000",null,"11830-0000","4484-0000"]
["5330-9001",80,"1\" NPT","Foot",null,"90118-0001","3101-0000","17937-0001-P","96080-0080","91003-0010","7867-0000","91003-0010","913-0000","92600-0060",null,null,"5337-0000","7868-0000","11831-0000","3784-9000"]
["5330-9101",80,"1\" NPT","Foot",null,"90118-0001","890-0000","17937-0001-P","96080-0080","91003-0010","17612-0001","91004-0090","913-0000","92600-0060",null,null,"5337-0000","7868-0000","11831-0000","3784-9000"]
["5400-205",80,"1-3/4\" BSP","Foot","52200-\n2051","SK406-0001",890,"17937-0001-P"]
["5560-0001",40,"1\" NPT","Flange",null,"90051-0001","3298-0000","1210-0001-P","92700-0060","91002-0020","7607-0000","91003-0010","913-0000","92600-0060",null,null,"Obsolete","7607-0000","11830-0000","Obsolete"]
["5660-0001",40,"1/2\" NPT","Flange",null,"90051-0001","3298-0000","1210-0001-P","92700-0060","91002-0020","7607-0000","91003-0010","913-0000","92600-0060",null,null,"Obsolete","7607-0000","11830-0000","Obsolete"]
["5840-0000",80,null,null,null,"90010-0001","3101-0000","17937-0001-P","92700-0060","91003-0010","3255-0000","91004-0090","913-0000","92600-0060",null,null,"5847-0000","4156-0000","11831-0000","Proprietary"]
["5850-0001",40,"3/4\" NPT","Flange",null,"SK33",3298,"12104-0001-P","SP2701-21","SP1002-02","Assy 7884","SP1003-01","SP2701-21","SP2600-13",null,"SP2600-13",5857,"Assy 7884",3992,5854]
["5850-0001",40,"3/4\" NPT","Flange",null,"90033-0001","3298-0000","12104-0001-P","92700-0060","91002-0020","7884-0000","91003-0010","92700-0060","92600-0130",null,"92600-0130","5857-0000","7884-0000","11830-0000","5854-0000"]
["6030-21",80,"1\" Flanged","Flange",null,"SK236",890,"17937-0001-P","SP2701-21","SP1003-09","934-0000","SP1004-09","SP2701-48",null,"SP2701-11","SP2600-06",6037,4156,3993,6034]
["6030-41",80,"1\" Flanged","Flange",null,"SK236",890,"17937-0001-P","SP2701-21","SP1003-09",2431,"SP1004-10","SP2701-48",null,"SP2701-11","SP2600-06",6037,4156,3993,6034]
["6030-61",80,"1\" Flanged","Flange",null,"SK236",890,"17937-0001-P","SP2701-21","SP1003-09",3255,"SP1004-11","SP2701-48",null,"SP2701-11","SP2600-06",6037,4156,3993,6034]
["6030-71",80,"1\" Flanged","Flange",null,"SK236",890,"17937-0001-P","SP2701-21","SP1003-09","934-0000","SP1004-09","SP2700-48",null,null,"SP2600-31",6037,4156,3993,6034]
["6400-0001",200,"1-1/4\" NPT","Foot",null,"90062-0001","816-0000","17935-0001-P","6407-0010","91005-0040","834-0001","91005-0040","817-0000","92600-0040","818-0000",null,"824-0020","2574-0000","12062-0000","6404-0000"]
["6400-0004",200,"1-1/4\" NPT","Foot",null,"90062-0001","816-0000","17935-0001-P","6407-0010","91005-0040","834-0001","91005-0040","817-0000","92600-0040","818-0000",null,"824-0020","2574-0000","12062-0000","6404-0000"]
["6400-0051",200,"1-1/4\" NPT","Foot",null,"90062-0001","816-0000","17935-0001-P","6407-0010","91005-0040","2551-0000","91005-0050","817-0000","92600-0040","818-0000",null,"824-0020","2574-0000","12062-0000","6404-0000"]
["6400-1051",200,"1-1/4\" NPT","Foot",null,"90062-0001","816-0000","17935-0001-P","6407-0010","91005-0040","2551-0000","91005-0050","817-0000","92600-0040","818-0000",null,"824-2001","2574-0000","12062-0000","6404-1000"]
["6400-200",200,"1-1/4\" BSP","Foot","52200-\n2001","SK230",816,"836-0001-P",21849,"SP1005-04",834,"SP1005-04","SP2700-50",null,"SP2700-49","SP2600-04",9527,2574,9336,"6404-200"]
["6400-205",200,"1-1/4\" BSP","Foot","52200-\n2051","SK230",816,"836-0001-P",21849,"SP1005-04",2551,"SP1005-05","SP2700-50",null,"SP2700-49","SP2600-04",9527,2574,9336,"6404-200"]
["6400-207",200,"1-1/4\" BSP","Foot","52200-\n2001","SK230",816,"836-0001-P",21849,"SP1005-04",834,"SP1005-04","SP2700-50",null,"SP2700-49","SP2600-04",9527,2574,9336,"6404-200"]
["6420-0101",80,"1\" NPT","Foot","52220-\n0011","SK236",890,"17937-0001-P","SP2701-21","SP1003-09","934-0000","SP1004-09","SP2700-48",null,"SP2700-47","SP2600-06",6718,4156,3993,6424]
["6420-200",80,"1\" BSP","Foot","52080-\n2001","SK236",890,"17937-0001-P","SP2701-21","SP1003-09","934-0000","SP1004-09","SP2700-48",null,"SP2700-47","SP2600-06","6718-21",4156,3993,6424]
["6420-2001",80,"1\" BSP","Foot","52080-\n2001","SK385-0201",890,"17937-0001-P","SP2700-1027","SP1003-09","934-0000","SP1004-09","SP2700-48",null,"SP2700-47","SP2600-06","6718-21",4156,3993,"6424-2200"]
["6420-204",80,"1\" BSP","Foot","52080-\n2041","SK236",890,"17937-0001-P","SP2701-21","SP1003-09",3255,"SP1004-10","SP2700-48",null,"SP2700-47","SP2600-06","6718-21",4156,3993,"6424-2200"]
["6420-2041",80,"1\" BSP","Foot","52080-\n2041","SK385-0201",3101,"17937-0001-P","SP2700-1027","SP1003-09",3255,"SP1004-10","SP2700-48",null,"SP2700-47","SP2600-06","6718-21",4156,3993,"6424-2200"]
["6420-205",80,"1\" BSP","Foot","52080-\n2051","SK236",890,"17937-0001-P","SP2701-21","SP1003-09",2431,"SP1004-10","SP2700-48",null,"SP2700-47","SP2600-06","6718-21",4156,3993,"6424-2200"]
["6420-2051",80,"1\" BSP","Foot","52080-\n2051","SK385-0201",2432,"17937-0001-P","SP2700-1027","SP1003-09",2431,"SP1004-10","SP2700-48",null,"SP2700-47","SP2600-06","6718-21",4156,3993,"6424-2200"]
["6490-122",40,"1/2\" BSP","Foot",null,"SK225-01",6496,"1210-0001-P","SP2701-21","SP1003-09",490,"SP1003-01",null,null,null,"SP2600-09","1737-207",null,3993,21634]
["6490-123",40,"1/2\" BSP","Foot",null,"SK225-01",6496,"1210-0001-P","SP2701-21","SP1003-09",490,"SP1003-01",null,null,null,"SP2600-09","1737-207",null,3993,21634]
["6490-132",40,"1/2\" BSP","Foot",null,"SK225-01",6496,"1210-0001-P","SP2701-21","SP1003-09",490,"SP1003-01",null,null,null,"SP2600-09","1737-207",null,3993,21634]
["6490-152",40,"0 25 Hose","Foot",null,"SK225-01","Use 23299 Kit to upgrade to 6490-122","-P",null,null,"Use 23299 Kit to  upgrade to 6490-122"]
["6490-153",40,"1/2\" BSP","Foot",null,"SK225-01","Use 23298 Kit to upgrade to 6490-123","-P",null,null,"Use 23298 Kit to  upgrade to 6490-123"]
["6490-200",40,"1/2\" BSP","Foot",null,"SK225-01",6496,"1210-0001-P","SP2701-21","SP1003-09",490,"SP1003-01",null,null,null,"SP2600-09","1737-24-01",null,3993,"6494-200"]
["6490-210",40,"1/2\" BSP","Foot",null,"SK225-01",6496,"1210-0001-P","SP2701-21","SP1003-09",490,"SP1003-01",null,null,null,"SP2600-09","1737-207",null,3993,"6494-200"]
["6490-222",40,"1/2\" BSP","Foot",null,"SK225-01",6496,"1210-0001-P","SP2701-21","SP1003-09",490,"SP1003-01",null,null,null,"SP2600-09","1737-207",null,3993,"6494-200"]
["6490-223",40,"1/2\" BSP","Foot",null,"SK225-01",6496,"1210-0001-P","SP2701-21","SP1003-09",490,"SP1003-01",null,null,null,"SP2600-09","1737-207",null,3993,"6494-200"]
["6490-224",40,"1/2\" BSP","Foot",null,"SK225-01",6496,"1210-0001-P","SP2701-21","SP1003-09",10336,"SP1003-09",null,null,null,"SP2600-09","1737-207",null,3993,"6494-200"]
["6490-225",40,"1/2\" BSP","Foot",null,"SK225-01",6496,"1210-0001-P","SP2701-21","SP1003-09",10336,"SP1003-09",null,null,null,"SP2600-09","1737-207",null,3993,"6494-200"]
["6490-231",40,"1/2\" BSP","Foot",null,"SK225-01",6496,"1210-0001-P","SP2701-21","SP1003-09",10336,"SP1003-09",null,null,null,"SP2600-09","1737-207",null,3993,"6494-200"]
["6490-232F",40,"1/2\" BSP","Foot",null,"SK119",6496,"3085-0001-P","SP6080-08","SP1003-09",490,"SP1003-01",null,null,null,"SP2600-09","1737-207",null,3993,"6494-200"]
["6490-241",40,"1/2\" BSP","Foot",null,"SK225-01","Use 23299 Kit to upgrade to 6490-222","-P",null,null,"Use 23299 Kit to  upgrade to 6490-222"]
["6490-246",40,"1/2\" BSP","Foot",null,"SK225-01","Use 23299 Kit to upgrade to 6490-224","-P",null,null,"Use 23299 Kit to  upgrade to 6490-224"]
["6490-252",40,"1/2\" BSP","Foot","6490-222","SK225-01","Use 23299 Kit to upgrade to 6490-222","-P",null,null,"Use 23299 Kit to  upgrade to 6490-222"]
["6490-253",40,"1/2\" BSP","Foot","6490-223","SK225-01","Use 23298 Kit to upgrade to 6490-223","-P",null,null,"Use 23298 Kit to  upgrade to 6490-223"]
["6490-254",40,"1/2\" BSP","Foot",null,"SK225-01","Use 23299 Kit to upgrade to 6490-224","-P",null,null,"Use 23299 Kit to  upgrade to 6490-224"]
["6490-255",40,"1/2\" BSP","Foot",null,"SK225-01","Use 23299 Kit to upgrade to 6490-225","-P",null,null,"Use 23299 Kit to  upgrade to 6490-225"]
["6490-2901",40,"1/2\" BSP","Foot",null,"SK225-01",6496,"1210-0001-P","SP2701-21","SP1003-09",490,"SP1003-01",null,null,null,"SP2600-09","1737-207",null,3993,"6494-200"]
["6520-200",80,"1\" BSP","Foot","51080-\n2001","SK236",890,"17937-0001-P","SP2701-21","SP1003-09","934-0000","SP1004-09","SP2700-48","SP2600-06",null,"SP2600-11","6718-201",4156,3993,"6424-2200"]
["6520-2003",80,"1\" BSP","Foot","51080-\n2003","SK385-0403",890,"17937-0003-P","SP2700-1027","SP1003-09","934-0000","SP1004-09","SP2700-48","SP2600-06",null,"SP2600-11","6718-201",4156,3993,"6424-2200"]
["6520-205",80,"1\" BSP","Foot",null,"SK236",890,"17937-0001-P","SP2701-21","SP1003-09",2431,"SP1004-10","SP2700-48","SP2600-06",null,"SP2600-11","6718-201",4156,3993,"6424-2200"]
["6520-237",80,"1\" BSP","Foot","51080-\n2001","SK235-37",890,"17937-0003-P","SP2701-21","SP1003-09","934-0000","SP1004-09","SP2700-48","SP2600-06",null,"SP2600-11","6718-201",4156,3993,"6424-2200"]
["6520-251",80,"1\" BSP","Foot","51080-\n2001","SK236",890,"17937-0001-P","SP2701-21","SP1003-09",2431,"SP1004-10","SP2700-48","SP2600-06",null,"SP2600-11","6718-201",4156,3993,"6424-2200"]
["6520-51",80,"1\" BSP","Foot",null,"SK236",890,"17937-0001-P","SP2701-21","SP1003-09","934-0000","SP1004-09","SP2700-48","SP2600-06",null,"SP2600-11","6718-201",4156,3993,"6424-2200"]
["6540-200",20,"3/8\" BSP","Foot",null,"SK205","2995-0030","673-0001-P","B22","SP1002-01","2907-0001","SP1002-02",null,null,null,null,6547,null,3992,"6544-200"]
["6540-201",20,"3/8\" BSP","Foot",null,"SK205-01","2995-0030","673-0001-P","B22","SP8019-01","2907-0001","SP1002-02",null,null,null,null,6547,null,3992,"6544-200"]
["6540-211",20,"3/8\" BSP","Foot",null,"SK205-01","2995-0030","673-0001-P","B22","SP8019-01","2907-0001","SP1002-02",null,null,null,null,6547,null,3992,"6544-200"]
["6590-0001",200,"1-1/4\" NPT","Foot",null,"90062-0001","816-0000","17935-0001-P","6407-0010","91005-0040","834-0001","91005-0040","817-0000","92600-0040",null,null,"824-0000","2574-0000","12062-0000","6594-0000"]
["6590-0003",200,"1-1/4\" NPT","Foot",null,"90062-0003","816-0000","836-0003-P","6407-0010","91005-0040","834-0001","91005-0040","817-0000","92600-0040",null,null,"824-0000","2574-0000","12062-0000","6594-0000"]
["6590-0004",200,"1-1/4\" NPT","Foot",null,"90062-0001","816-0000","17935-0001-P","6407-0010","91005-0040","834-0001","91005-0040","817-0000","92600-0040",null,null,"824-0000","2574-0000","12062-0000","6594-0000"]
["6590-0005",200,"1-1/4\" NPT","Foot",null,"90062-0003","816-0000","836-0003-P","6407-0010","91005-0040","834-0001","91005-0040","817-0000","92600-0040",null,null,"824-0000","2574-0000","12062-0000","6594-0000"]
["6590-200",200,"1-1/4\" BSP","Foot","51200-\n2011","SK230",816,"836-0001-P",21849,"SP1005-04",834,"SP1005-04","SP2700-50","SP2600-04",null,"SP2600-09","9527-0001",2574,9336,"6594-200"]
["6590-237",200,"1-1/4\" BSP","Foot","51200-\n2003","SK230-37",816,"836-0003-P",21849,"SP1005-04",834,"SP1005-04","SP2700-50","SP2600-04",null,"SP2600-09","9527-0001",2574,9336,"6594-200"]
["6640-200",10,"1/4\" BSP","Foot","52010-\n2001","SK23",1189,"4528-0001-P","SP2701-14","SP1002-01",2763,"SP1002-03","SP2700-63",null,"SP2700-62","SP2600-08",1053,2765,9566,"6644-200"]
["6640-205",10,"3/8\" BSP","Foot","52010-\n2001","SK23",1189,"4528-0001-P","SP2701-14","SP1002-01",21233,"SP1002- 0234","SP2700-63",null,"SP2700-62","SP2600-08",1053,2765,"6645-105","6644-200"]
["6980-0001",270,"2\" Flanged","Flange",null,"90065-0001","816-0000","17936-0001-P","6408-0000","91005-0040","6988-0000","91005-0040","817-0000","92600-0320",null,null,"6987-0000","2574-0000","12062-0000","Proprietary"]
["6980-0002",270,"2\" Flanged","Flange",null,"90065-0001","816-0000","17936-0001-P","6408-0000","91005-0040","6988-0000","91005-0040","817-0000","92600-0320",null,null,"6987-0000","2574-0000","12062-0000","Proprietary"]
["6980-0003",270,"2\" Flanged","Flange",null,"90065-0001","816-0000","17936-0001-P","6408-0000","91005-0040","6988-0000","91005-0040","817-0000","92600-0320",null,null,"6987-0000","2574-0000","12062-0000","Proprietary"]
["6980-0004",270,"2\" Flanged","Flange",null,"90065-0001","816-0000","17936-0001-P","6408-0000","91005-0040","6988-0000","91005-0040","817-0000","92600-0320",null,null,"6987-0000","2574-0000","12062-0000","Proprietary"]
["6980-0005",270,"2\" Flanged","Flange",null,"90065-0001","816-0000","17936-0001-P","6408-0000","91005-0040","6988-0000","91005-0040","817-0000","92600-0320",null,null,"6987-0000","2574-0000","12062-0000","Proprietary"]
["6980-0006",270,"2\" Flanged","Flange",null,"90065-0001","816-0000","17936-0001-P","6408-0000","91005-0040","6988-0000","91005-0040","817-0000","92600-0320",null,null,"6987-0000","2574-0000","12062-0000","Proprietary"]
["6980-0011",270,"2\" Flanged","Flange",null,"90065-0001","816-0000","17936-0001-P","6408-0000","91005-0040","6988-0000","91005-0040","817-0000","92600-0320",null,null,"6987-0000","2574-0000","12062-0000","Proprietary"]
["6980-0411",270,"2\" Flanged","Flange",null,"90065-0001","816-0000","17936-0001-P","6408-0000","91005-0040","6988-0000","91005-0040","817-0000","92600-0320",null,null,"6987-0000","2574-0000","12062-0000","Proprietary"]
["6980-3000",270,"2\" Flanged","Flange",null,"90065-0001","816-0000","17936-0001-P","6408-0000","91005-0040","6988-0000","91005-0040","817-0000","92600-0320",null,null,"6987-0000","2574-0000","12062-0000","Proprietary"]
["7120-9001",40,"3/4\" I 1-1/4\"\nHose","Flange",null,"90111-0001","3298-0000","1210-0001-P","96080-0080","91002-0020","7607-0000","91003-0010","913-0000","92600-0060",null,null,"7127-0000","7607-0000","11830-0000","Obsolete"]
["7260-0001",80,"1-1/4\"\nFlanged","Flange",null,null,"3101-0000","17937-0001-P","SP2700-07","91003-0010","7874-0000","91003-0020","913-0000","92600-0060",null,null,"7267-0000","7874-\n000000","11831-0000","Obsolete"]
["7320-9001",40,"3/4\" I 1-1/4\"\nHose","Flange",null,"90111-0001","3298-0000","1210-0001-P","96080-0080","91002-0020","7607-0000","91003-0010","913-0000","92600-0060",null,null,"7127-0000","7607-0000","11830-0000","Obsolete"]
["7420-0001",200,"1-1/4\" NPT","Foot",null,"90062-0001","816-0000","17935-0001-P","6407-0010","91005-0040","834-0001","91005-0040","817-0000","92600-0040","818-0000",null,"824-0020","2574-0000","12062-0000","7424-0000"]
["7420-0004",200,"1-1/4\" NPT","Foot","7420-0101","SK375-0101",816,"17935-0001-P",21849,"SP1005-04",834,"SP1005-04",817,"SP2600-04",818,null,824,2574,7425,7424]
["7420-0004",200,"1-1/4\" NPT","Foot",null,"90062-0001","816-0000","17935-0001-P","6407-0010","91005-0040","834-0001","91005-0040","817-0000","92600-0040","818-0000",null,"824-0020","2574-0000","12062-0000","7424-0000"]
["7420-0101",200,"1-1/4\" NPT","Foot",null,"SK375-0101",816,"17935-0001-P",21849,"SP1005-04",834,"SP1005-04","SP2700-50","SP2600-04","SP2700-49",null,9527,2574,9336,"7424-0100"]
["7420-0101",200,"1-1/4\" NPT","Foot",null,"90062-0000","816-0000","17935-0001-P","6408-0000","91005-0040","834-0001","91005-0040","817-0000","92600-0040","818-0000",null,"824-0020","2574-0000","12062-0000","Proprietary"]
["7420-1001",200,"1-1/4\" NPT","Foot",null,"90062-0001","816-0000","17935-0001-P","6407-0010","91005-0040","834-0001","91005-0040","817-0000","92600-0040","818-0000",null,"824-2001","2574-0000","12062-0000","7424-0000"]
["777-0001",80,"1\" BSP","Foot",null,"90010-0001","890-0000","17937-0001-P","92700-0060","91003-0010","934-0000","91004-0090","913-0000","92600-0540","914-0000",null,"6718-0000","4156-0000","11831-0000","798-0020"]
["777-0003",80,"1\" NPT","Foot",null,"90010-0003","890-0000","920-0003-P","92700-0060","91003-0010","934-0000","91004-0090","913-0000","92600-0540","914-0000",null,"6718-0000","4156-0000","11831-0000","798-0020"]
["777-9001",80,"1\" NPT","Foot",null,"90118-0001","890-0000","17937-0001-P","96080-0080","91003-0010","934-0000","91004-0090","913-0000","92600-0540","914-0000",null,"6718-0000","4156-0000","11831-0000","798-0020"]
["777-9003",80,"1\" NPT","Foot",null,"90118-0003","890-0000","920-0003-P","96080-0080","91003-0010","934-0000","91004-0090","913-0000","92600-0540","914-0000",null,"6718-0000","4156-0000","11831-0000","798-0020"]
["777-9004",80,"1\" NPT","Foot",null,"90118-0001","890-0000","14282-0004-P","96080-0080","91003-0010","934-0000","91004-0090","913-0000","92600-0540","914-0000",null,"17941-0000","4156-0000","11831-0000","798-0020"]
["777-9005",80,"1\" NPT","Foot",null,"90118-0003","890-0000","920-0003-P","96080-0080","91003-0010","934-0000","91004-0090","913-0000","92600-0540","914-0000",null,"6718-0000","4156-0000","11831-0000","798-0020"]
["777-9011",80,"1\" NPT","Foot",null,"90118-0001","890-0000","17937-0001-P","96080-0080","91003-0010","934-0000","91004-0090","913-0000","92600-0540","914-0000",null,"6718-0000","4156-0000","11831-0000","798-0020"]
["777-9051",80,"1\" NPT","Foot",null,"90118-0001","2432-0000","17937-0001-P","96080-0080","91003-0010","2431-0000","91004-0100","913-0000","92600-0540","914-0000",null,"6718-0000","4156-0000","11831-0000","798-0020"]
["7870-200",200,"1-1/2\" BSP","Foot",null,"SK230",816,"836-0001-P",21849,"SP1005-04",834,"SP1005-04","SP2700-50","SP2600-04",null,"SP2600-09","9527-0001",2574,9336,"6594-200"]
["7870-201",200,"1-1/2\" BSP","Foot",null,"SK230",816,"836-0001-P",21849,"SP1005-04",834,"SP1005-04","SP2700-50","SP2600-04",null,"SP2600-09","9807-201",2574,9336,"6594-200"]
["7870-221",200,"1-1/2\" BSP","Foot",null,"SK230",816,"836-0001-P",21849,"SP1005-04",834,"SP1005-04","SP2700-50","SP2600-04",null,"SP2600-09","9527-0001",2574,9336,"6594-200"]
["7870-231",200,"1-1/2\" BSP","Foot",null,"SK230",816,"836-0001-P",21849,"SP1005-04",834,"SP1005-04","SP2700-50","SP2600-04",null,"SP2600-09","9807-201",2574,9336,"6594-200"]
["7870-251",200,"1-1/2\" BSP","Foot",null,"SK230",816,"836-0001-P",21849,"SP1005-04",834,"SP1005-04","SP2700-50","SP2600-04",null,"SP2600-09","9807-201",2574,9336,"6594-200"]
["8150-0211",80,"2-1/2\"\nFlanged","Foot",null,null,"7478-6000","17935-0001-P","6408-0000","91045-0420","7486-0010","91012-0020","817-0000","92600-0040","92700-0740","92600-0040","Proprietary","7476-0000","12073-0010","Proprietary"]
["8170-9001",80,"3/4\" NPT","Flange",null,"90118-0001","3101-0000","17937-0001-P","96080-0080","91003-0010","3255-0000","91004-0110","913-0000","92600-0060",null,null,"Obsolete","4156-0000","11831-0000","Obsolete"]
["823-200",200,"1-3/4\" BSP","Foot",null,"SK11",816,"836-0001-P",1814,"SP1005-04","-","-","-","-","-","-","-","-","-","-"]
["823-205",200,"1-3/4\" BSP","Foot",null,"SK11",816,"836-0001-P",1814,"SP1005-04","-","-","-","-","-","-","-","-","-","-"]
["8470-0711",80,"3/4\" Hose","Flange",null,"90177-0001","8509-0001","3085-0001-P","96080-0080","91003-0010","8528-0000","91003-0010","93000-0090","92600-0350",null,null,"Obsolete","8493-0000","12065-0000","Obsolete"]
["8470-0911",80,"3/4\" Hose","Flange",null,"90177-0001","8509-0001","3085-0001-P","96080-0080","91003-0010","8528-0000","91003-0010","93000-0090","92600-0350",null,null,"Obsolete","8493-0000","12065-0000","Obsolete"]
["8740F",40,"Dual 3/4\" Hose","Flange",null,null,null,"8444-\n0001(2)-P",null,"SP1002-01",6148]
["8830-0701",80,"1\" Hose","Flange",null,"90177-0121","8641-0000","3085-0001-P","92700-0060","91026-0010","8528-0000","91030-0110","93000-0070","92600-0070",null,null,"Obsolete","8493-0000","Obsolete","Obsolete"]
["8830-0711",80,"1\" Hose","Flange",null,"90177-0121","8641-0000","3085-0001-P","92700-0060","91026-0010","8528-0000","91030-0110","93000-0070","92600-0070",null,null,"Obsolete","8493-0000","Obsolete","Obsolete"]
["8850-0001",5,null,null,null,"90092-0007","7828-0000","14750-0001-P","93000-0100","91026-0010","8528-0000","91030-0110","93000-0070","92600-0070",null,null,"Obsolete","8493-0000","Obsolete","Obsolete"]
["8950-0001",200,"1-1/2\"\nFlanged","Flange",null,null,"816-0000","17935-0001-P","6408-0000","91095-0060","834-0001","91005-0040","694-0000","92600-0040",null,null,"8957-0000","2574-0000","12062-0000","8954-0000"]
["9040-0511",5,"1/2\" Hose","Flange","now-1021","SK92-11","7828-01","14609-0001-P","SP3000-10","SP1002-09",8089,"SP1002-01",null,null,null,null,null,null,12076,9044]
["9400-01",20,"0  16 Hose","Flange",null,"SK211",10817,"673-0001-P","SP2701-04","SP1002-09","2907-0001","SP1002-09",null,null,null,null,9407,null,"9406-01","9404-01"]
["9400-200",20,"2\" BSP","Foot",null,"SK211",10817,"673-0001-P","SP2701-04","SP1002-09","2907-0001","SP1002-09",null,null,null,null,9407,null,"9406-01","9404-01"]
["9430-01",10,"1/4\" BSP","Flange","11650-200","SK221",1126,"4528-0001-P","SP2701-09","SP1002-01","ALS","SP1002-09",null,null,"SP2701-09",null,10303,null,"AL6-200",10302]
["9430-21",10,"1/4\" BSP","Flange",null,"SK221",1126,"4528-0001-P","SP2701-09","SP1002-01","ALB","SP1002-09",null,null,"SP2701-09",null,10467,null,"AL6-200",4784]
["9430-211",10,"1/4\" BSP","Flange","29300-\n2601C","SK221",1126,"4528-0001-P","SP2701-09","SP1002-01","ALB","SP1002-09",null,null,"SP2701-09",null,22287,null,"AL6-200",4784]
["9430-51",10,"1/4\" BSP","Flange",null,"SK221",1126,"4528-0001-P","SP2701-09","SP1002-01","ALS-01","SP1002-02",null,null,"SP2701-09",null,9436,null,"9435-51",4784]
["9480-01",500,"2\" BSP","Foot",null,"SK29",3209,"2999-0001-P",3222,"SP1006-05",9446,"SP1006-03","SP2700-59","SP2600-16","SP2700-58","SP2600-15",3207,9316,9448,9444]
["9700-01",80,"1\" Flanged","Flange",null,"SK238",890,"17937-0001-P","2264S-0000","SP1003-01","934-0000","SP1004-09","SP2700-48",null,null,"SP2600-06",9707,4156,3993,"9704-01"]
["9700-04",80,"1\" Flanged","Flange",null,"SK238-01",3101,"17937-0001-P","22645-0000","SP1003-01",3255,"SP1004-11","SP2700-48",null,null,"SP2600-06",9707,4156,3993,"9704-01"]
["9700-0S",80,"1\" Flanged","Flange",null,"SK238-21",2432,"17937-0001-P","2264S-0000","SP1003-01",2431,"SP1004-10","SP2700-48",null,null,"SP2600-06",9707,4156,3993,"9704-01"]
["9700-101",80,"1\" BSP","Flange","9700-04","SK238",890,"17937-0001-P","22645-0000","SP1003-01",2431,"SP1004-10","SP2700-48",null,"SP2701-11","SP2600-06",9707,4156,3993,"9704-01"]
["9700-131",80,"1\" Flanged","Flange",null,"SK238",890,"17937-0001-P","2264S-0000","SP1003-01","934-0000","SP1004-09","SP2700-48",null,null,"SP2600-06","9707-31",4156,3993,"9704-31"]
["9700-132",80,"1\" Flanged","Flange",null,"SK238",890,"17937-0001-P","22645-0000","SP1003-01","934-0000","SP1004-09","SP2700-48",null,null,"SP2600-06","9707-31",4156,3993,"9704-32"]
["9700-141",80,"1\" Flanged","Flange","9700-04","SK238",890,"17937-0001-P","2264S-0000","SP1003-01","934-0000","SP1004-09","SP2700-48",null,null,"SP2600-06",9707,4156,3993,"9704-01"]
["9700-151",80,"1\" Flanged","Flange",null,"SK238-01",3101,"17937-0001-P","22645-0000","SP1003-01",3255,"SP1004-11","SP2700-48",null,null,"SP2600-06",9707,4156,3993,"9704-01"]
["9700-162",80,"1\" Flanged","Flange",null,"SK238",890,"17937-0001-P","2264S-0000","SP1003-01","934-0000","SP1004-09","SP2700-48",null,null,"SP2600-06","21635-0010",4156,3993,"9704-0010"]
["9700-171",80,"1\" Flanged","Flange",null,"SK238",890,"17937-0001-P","22645-0000","SP1003-01",3255,"SP1004-11","SP2700-48",null,null,"SP2600-06",9707,4156,3993,9704]
["9700-181",80,"1\" Flanged","Flange",null,"SK238",890,"17937-0001-P","2264S-0000","SP1003-01","934-0000","SP1004-09","SP2700-48",null,null,"SP2600-06",9707,4156,3993,9704]
["9700-21",80,"1\" Flanged","Flange","29600-\n1001","SK238",890,"17937-0001-P","22645-0000","SP1003-01","934-0000","SP1004-09","SP2700-48",null,"SP2701-11","SP2600-06",9707,4156,3993,"9704-01"]
["9700-241",80,"3/4\" BSP","Flange",null,"SK238",890,"17937-0001-P","2264S-0000","SP1003-01"]
["9700-41",80,"1\" Flanged","Flange",null,"SK238-21",2432,"17937-0001-P","22645-0000","SP1003-01",2431,"SP1004-10","SP2700-48",null,"SP2701-11","SP2600-06",9707,4156,3993,"9704-01"]
["9700-51",80,"1\" Flanged","Flange",null,"SK238",890,"17937-0001-P","2264S-0000","SP1003-01","934-0000","SP1004-09","SP2700-48",null,null,"SP2600-06","9707-01",4156,3993,"9704-51"]
["9700-61",80,"1\" Flanged","Flange",null,"SK238",890,"17937-0001-P","22645-0000","SP1003-01",3255,"SP1004-11","SP2700-48",null,"SP2701-11","SP2600-06",9707,4156,3993,9704]
["9700-71",80,"1\" Flanged","Flange",null,"SK238",890,"17937-0001-P","2264S-0000","SP1003-01","934-0000","SP1004-09","SP2700-48",null,null,"SP2600-06",9707,4156,3993,"9704-01"]
["9710-200",80,"1\" BSP","Foot",null,"SK229",890,"17937-0001-P","22617-0010","SP1003-09","934-0000","SP1004-09","SP2701-21","SP2600-38","SP2700-47","SP2600-38",9717,4156,3993,"10329-200"]
["9710-201",80,"1\" BSP","Foot",null,"SK229",890,"17937-0001-P","22617-0010","SP1003-09",3255,"SP1004-11","SP2701-21","SP2600-38","SP2700-47","SP2600-38",9717,4156,3993,"10329-200"]
["9710-204",80,"1\" BSP","Foot",null,"SK229",890,"17937-0001-P","22617-0010","SP1003-09",3255,"SP1004-10","SP2701-21","SP2600-38","SP2700-47","SP2600-38",9717,4156,3993,"10329-200"]
["9710-205",80,"1\" BSP","Foot",null,"SK229-01",2432,"17937-0001-P","22617-0010","SP1003-09",2431,"SP1004-10","SP2701-21","SP2600-38","SP2700-47","SP2600-38",9717,4156,3993,"10329-200"]
["9710-210",80,"1\" BSP","Foot",null,"SK229",890,"17937-0001-P","22617-0010","SP1003-09",3255,"SP1004-11","SP2701-21","SP2600-38","SP2700-47","SP2600-38",9717,4156,3993,"10329-200"]
["9770-200",80,"3/4\" BSP","Barrel",null,"SK229",890,"17937-0001-P","22626-0000","SP1003-09","934-0000","SP1004-09","SP2701-21","SP2600-38","SP2700-47","SP2600-38",9777,4156,3993]
["9770-205",80,"3/4\" BSP","Barrel",null,"SK229",890,"17937-0001-P","22626-0000","SP1003-09",2431,"SP1004-10","SP2701-21","SP2600-38","SP2700-47","SP2600-38",9777,4156,3993]
["9900-0001",20,"5/8\" Hose","Flange",null,"90211-0001","10187-0000","18673-0001-P","92701-0040","91002-0090","10818-0000","91002-0020",null,null,null,null,"9907-0000",null,"9905-0000","9904-0000"]
["9970-200",40,"3/4\" BSP","Flange",null,"SK229",3298,"1210-0001-P","22617-0010","SP1002-02",490,"SP1003-01","SP2701-21","SP2600-13",null,"SP2600-13",9977,7883,3992,"9974-200"]
["9970-204",40,"3/4\" BSP","Flange",null,"SK239",3298,"1210-0001-P","22617-0010","SP1002-02",10336,"SP1003-09","SP2701-21","SP2600-13",null,"SP2600-13",9977,7883,3992,"9974-200"]
["9970-241",40,"3/4\" BSP","Flange","Direct Cooling","SK241",3298,"1210-0001-P","22617-0010","SP1002-02",490,"SP1003-01","SP2701-21","SP2600-13",null,"SP2600-13",10374,7883,3992,"9974-200"]
["9970-241-37",40,"3/4\" BSP","Flange",null,"SK239-37",3298,"1210-0003-P","22617-0010","SP1002-02",490,"SP1003-01","SP2701-21","SP2600-13",null,"SP2600-13",10374,7883,3992,"9974-200"]
["9970-261",40,"3/4\" BSP","Flange",null,"SK239",3298,"1210-0001-P","22617-0010","SP1002-02",490,"SP1003-01","SP2701-21","SP2600-13",null,"SP2600-13","9977-21",7883,3992,"9974-201"]
["9970-271",40,"3/4\" BSP","Flange","9970-200","SK239",3298,"1210-0001-P","22617-0010","SP1002-02",10336,"SP1003-09","SP2701-21","SP2600-13",null,"SP2600-13","9977-21",7883,3992,"9974-223"]
["9970-281",40,"3/4\" BSP","Flange",null,"SK239",3298,"1210-0001-P","22617-0010","SP1002-02",490,"SP1003-01","SP2701-21","SP2600-13",null,"SP2600-13",9977,7883,3992,"9974-223"]
["9970-2S1",40,"3/4\" BSP","Flange","9970-241","SK239",3298,"1210-0001-P","22617-0010","SP1002-02",10336,"SP1003-09","SP2701-21","SP2600-13",null,"SP2600-13",10374,7883,3992,"9974-200"]
["9990-200",40,"3/4\" NPT","Barrel",null,"SK239",3298,"1210-0001-P","22617-0010","SP1002-02",490,"SP1003-01","SP2701-21","SP2601-39","SP2701-15","SP2601-39",9997,7883,3992,"9974-200"]
["9990-201",40,"3/4\" NPT","Barrel",null,"SK239",3298,"1210-0001-P","22617-0010","SP1002-02",490,"SP1003-01","SP2701-21","SP2601-39","SP2701-15","SP2601-39",10417,7883,3992,"9974-200"]
["9990-21",40,"3/4\" NPT","Barrel","9990-41","SK268",3298,"1210-0001-P","22617-0010","SP1002-02",490,"SP1003-01","SP2701-21","SP2601-39","SP2701-15","SP2601-39",9997,9996,3992,"9994-21"]
["9990-41",40,"3/4\" NPT","Barrel",null,"SK268",3298,"1210-0001-P","22617-0010","SP1002-02",490,"SP1003-01","SP2701-21","SP2601-39","SP2701-15","SP2601-39","9997-01",7883,3992,"9994-21"]
["AL 1/4\"-200",10,"1/4\" BSP","Foot",null,"SK1",1126,"4528-0001-P","AL22","SP1002-01","ALB","SP1002-02",null,null,null,null,"AL10",null,"AL6-200","AL4-200"]
["AL 1/4\"-204",10,"1/4\" BSP","Foot",null,"SK1",1126,"4528-0001-P","AL22","SP1002-01","ALS-01","SP1002-09",null,null,null,null,"AL10",null,"AL6-200","AL4-200"]
["AL 1/4\"-237",10,"1/4\" BSP","Foot",null,"SK1-37",1126,"4528-0003-P","AL22","SP1002-01","ALB","SP1002-02",null,null,null,null,"AL10",null,"AL6-200","AL4-200"]
["B 3/8\"-200",20,"3/8\" BSP","Foot","6540-200","SK2","2995-0030","4527-0001-P","B22","SP1002-01","2907-0001","SP1002-02",null,null,null,null,"B10",null,3992,"B8-200"]
["JD 3/4\"-200",40,"3/4\" BSP","Foot",null,"SK220","706-01","4598-0001-P","C20","SP1003-02","934-0000","SP1004-01",null,null,null,null,"D10-01",null,"D6-01-200","JD4-200"]
["JD 3/4\"-201",40,"3/4\" BSP","Foot","JD 3/4\"- 200","SK220","706-01","4598-0001-P",3791,"SP1003-02","934-0000","SP1004-01",null,null,null,null,"D10-201",null,"D6-01-200","JD4-200"]
["JD 3/4\"-205",40,"3/4\" BSP","Foot",null,"SK220","706-01","4598-0001-P",3791,"SP1003-02",2431,"SP1004-09",null,null,null,null,"D10-01",null,"D6-01-200","JD4-200"]
["JD 3/4\"-208",40,"3/4\" BSP","Foot","JD 3/4\"- 200","SK220","706-01","4598-0001-P","C20","SP1003-02","934-0000","SP1004-01",null,null,null,null,"D10-01",null,"D6-01-200","JD4-200"]
["JD 3/4\"-237",40,"3/4\" BSP","Foot",null,"SK220-37","706-01","4598-0003-P","C20","SP1003-02","934-0000","SP1004-01",null,null,null,null,"D10-01",null,"D6-01-200","JD4-200"]

{"sheet":"Obsolete","index":3,"n_rows":479,"n_cols":4,"rows_kept":479,"cut":false,"hidden":false,"merged":[]}
["PART NUMBER TRANSLATION"]
["PUMP","OBSOLETE JABSCO PART NUMBER","CURRENT JABSCO PART NUMBER","DESCRIPTION"]
["52200-2011","9336","10773-0000","END COVER BRASS 200/270"]
["52200-2011","X3001-176F","X3003-176F-P","SCREW M6 X 10"]
[]
[]
[]
[]
["JABSCO OBSOLETE LIST",4850,9750,"Pump"]
["JABSCO OBSOLETE LIST",4860,9760,"Pump"]
["JABSCO OBSOLETE LIST",9710,"9710-200","Pump"]
["JABSCO OBSOLETE LIST",9900,"29470-2231C","Pump"]
["JABSCO OBSOLETE LIST",10420,"29490-2001C","Pump"]
["JABSCO OBSOLETE LIST",10490,"52270-0011","Pump"]
["JABSCO OBSOLETE LIST",10590,"10590-22","Pump"]
["JABSCO OBSOLETE LIST",10630,"52220-0011","Pump"]
["JABSCO OBSOLETE LIST",10650,"51220-0011","Pump"]
["JABSCO OBSOLETE LIST",10660,"51270-0011","Pump"]
["JABSCO OBSOLETE LIST",10670,"50220-0011","Pump"]
["JABSCO OBSOLETE LIST",10680,"50270-0011","Pump"]
["JABSCO OBSOLETE LIST",10880,"10880-07","Pump"]
["JABSCO OBSOLETE LIST",21890,"10880-2611","Pump"]
["JABSCO OBSOLETE LIST",22620,"29440-1101","Pump"]
["JABSCO OBSOLETE LIST",22770,"29440-1001","Pump"]
["JABSCO OBSOLETE LIST","10490-0201","50270-0911","Pump"]
["JABSCO OBSOLETE LIST","10490-07","52270-0011","Pump"]
["JABSCO OBSOLETE LIST","10490-207","52270-0011","Pump"]
["JABSCO OBSOLETE LIST","10590-01","11101-01-01","Pump"]
["JABSCO OBSOLETE LIST","10590-0141","10590-0041","Pump"]
["JABSCO OBSOLETE LIST","10590-21","10590-22","Pump"]
["JABSCO OBSOLETE LIST","10590-61","10590-62","Pump"]
["JABSCO OBSOLETE LIST","10630-01","52220-0011","Pump"]
["JABSCO OBSOLETE LIST","10630-07","52220-0011","Pump"]
["JABSCO OBSOLETE LIST","10630-200","52220-0011","Pump"]
["JABSCO OBSOLETE LIST","10630-207","52220-0011","Pump"]
["JABSCO OBSOLETE LIST","10630-57","52220-0011","Pump"]
["JABSCO OBSOLETE LIST","10650-0003","51220-0011","Pump"]
["JABSCO OBSOLETE LIST","10650-200","51200-2011","Pump"]
["JABSCO OBSOLETE LIST","10660-0003","51270-0011","Pump"]
["JABSCO OBSOLETE LIST","10660-200","51270-2011","Pump"]
["JABSCO OBSOLETE LIST","10670-0003","50220-0011","Pump"]
["JABSCO OBSOLETE LIST","10670-01","50220-0111","Pump"]
["JABSCO OBSOLETE LIST","10670-0103","50220-0111","Pump"]
["JABSCO OBSOLETE LIST","10670-0203","50220-0211","Pump"]
["JABSCO OBSOLETE LIST","10670-0303","50220-0311","Pump"]
["JABSCO OBSOLETE LIST","10670-10","50220-0211","Pump"]
["JABSCO OBSOLETE LIST","10670-11","50220-0311","Pump"]
["JABSCO OBSOLETE LIST","10670-200","50200-2011","Pump"]
["JABSCO OBSOLETE LIST","10670-201","50200-2111","Pump"]
["JABSCO OBSOLETE LIST","10670-210","50200-2211","Pump"]
["JABSCO OBSOLETE LIST","10670-211","50200-2311","Pump"]
["JABSCO OBSOLETE LIST","10680-0003","50270-0011","Pump"]
["JABSCO OBSOLETE LIST","10680-01","50270-0111","Pump"]
["JABSCO OBSOLETE LIST","10680-0103","50270-0111","Pump"]
["JABSCO OBSOLETE LIST","10680-0203","50270-0211","Pump"]
["JABSCO OBSOLETE LIST","10680-0303","50270-0311","Pump"]
["JABSCO OBSOLETE LIST","10680-10","50270-0211","Pump"]
["JABSCO OBSOLETE LIST","10680-11","50270-0311","Pump"]
["JABSCO OBSOLETE LIST","10680-200","50270-2011","Pump"]
["JABSCO OBSOLETE LIST","10680-201","50270-2111","Pump"]
["JABSCO OBSOLETE LIST","10680-210","50270-2211","Pump"]
["JABSCO OBSOLETE LIST","10680-211","50270-2311","Pump"]
["JABSCO OBSOLETE LIST","10880-2461","10880-2561","Pump"]
["JABSCO OBSOLETE LIST","10950-200","10950-2401","Pump"]
["JABSCO OBSOLETE LIST","10950-201","10950-2401","Pump"]
["JABSCO OBSOLETE LIST","10950-204","10950-2401","Pump"]
["JABSCO OBSOLETE LIST","10950-205","10950-2401","Pump"]
["JABSCO OBSOLETE LIST","10950-2101","10950-2401","Pump"]
["JABSCO OBSOLETE LIST","10950-2141","10950-2401","Pump"]
["JABSCO OBSOLETE LIST","10950-2201","10950-2601","Pump"]
["JABSCO OBSOLETE LIST","10950-2241","10950-2601","Pump"]
["JABSCO OBSOLETE LIST","10950-2441","10950-2601","Pump"]
["JABSCO OBSOLETE LIST","10950-2451","10950-2601","Pump"]
["JABSCO OBSOLETE LIST","10950-2701","10950-2401","Pump"]
["JABSCO OBSOLETE LIST","10980-01","10980-0051","Pump"]
["JABSCO OBSOLETE LIST","11260-200","29300-2101C","Pump"]
["JABSCO OBSOLETE LIST","11260-205","29300-2151C","Pump"]
["JABSCO OBSOLETE LIST","11260-2101","29300-2201C","Pump"]
["JABSCO OBSOLETE LIST","11260-2151","29300-2151C","Pump"]
["JABSCO OBSOLETE LIST","11620-200","22830-2101","Pump"]
["JABSCO OBSOLETE LIST","11850-0101","11850-0701","Pump"]
["JABSCO OBSOLETE LIST","21090-200","21090-204","Pump"]
["JABSCO OBSOLETE LIST","21130-200","21130-2101","Pump"]
["JABSCO OBSOLETE LIST","21140-200","21140-2401","Pump"]
["JABSCO OBSOLETE LIST","21140-201","21140-2401","Pump"]
["JABSCO OBSOLETE LIST","21140-204","21140-2401","Pump"]
["JABSCO OBSOLETE LIST","21140-2101","21140-2601","Pump"]
["JABSCO OBSOLETE LIST","21140-2141","21140-2601","Pump"]
["JABSCO OBSOLETE LIST","21140-2201","21140-2601","Pump"]
["JABSCO OBSOLETE LIST","21140-2241","21140-2601","Pump"]
["JABSCO OBSOLETE LIST","21820-200","52040-2001","Pump"]
["JABSCO OBSOLETE LIST","21820-2001","52040-2001","Pump"]
["JABSCO OBSOLETE LIST","21820-2003","52040-2003","Pump"]
["JABSCO OBSOLETE LIST","21820-2021","52040-2021","Pump"]
["JABSCO OBSOLETE LIST","21960-200","50080-2001","Pump"]
["JABSCO OBSOLETE LIST","21960-2003","50080-2003","Pump"]
["JABSCO OBSOLETE LIST","21960-210","50080-2101","Pump"]
["JABSCO OBSOLETE LIST","21960-2103","50080-2103","Pump"]
["JABSCO OBSOLETE LIST","21960-211","50080-2201","Pump"]
["JABSCO OBSOLETE LIST","21960-2203","50080-2203","Pump"]
["JABSCO OBSOLETE LIST","21960-221","50080-2301","Pump"]
["JABSCO OBSOLETE LIST","21960-2303","50080-2303","Pump"]
["JABSCO OBSOLETE LIST","22040-0131","22040-0501","Pump"]
["JABSCO OBSOLETE LIST","22740-0251","22740-0151","Pump"]
["JABSCO OBSOLETE LIST","22740-0301","22740-0201","Pump"]
["JABSCO OBSOLETE LIST","22750-05","22750-1101","Pump"]
["JABSCO OBSOLETE LIST","22770-1051","29440-1051","Pump"]
["JABSCO OBSOLETE LIST","22770-1101","29440-1101","Pump"]
["JABSCO OBSOLETE LIST","22770-1201","29440-1201","Pump"]
["JABSCO OBSOLETE LIST","22940-2001","52010-2001","Pump"]
["JABSCO OBSOLETE LIST","22950-2031","52020-2001","Pump"]
["JABSCO OBSOLETE LIST","22950-2037","52020-2001","Pump"]
["JABSCO OBSOLETE LIST","23328-0000","23328-9000","Pump"]
["JABSCO OBSOLETE LIST","23387-0000","23387-0020","Pump"]
["JABSCO OBSOLETE LIST","23800-0251","23800-0201","Pump"]
["JABSCO OBSOLETE LIST","23800-0351","23800-0401","Pump"]
["JABSCO OBSOLETE LIST","2620-211","2620-200","Pump"]
["JABSCO OBSOLETE LIST","2620-221","2620-200","Pump"]
["JABSCO OBSOLETE LIST","2620-254","2620-252","Pump"]
["JABSCO OBSOLETE LIST","2620-281","2620-252","Pump"]
["JABSCO OBSOLETE LIST","29470-0231","29470-1231","Pump"]
["JABSCO OBSOLETE LIST","29470-0231C","29470-1231C","Pump"]
["JABSCO OBSOLETE LIST","29850-0031","29880-0001","Pump"]
["JABSCO OBSOLETE LIST","3200-01","9440-200","Pump"]
["JABSCO OBSOLETE LIST","3270-200","29500-1001","Pump"]
["JABSCO OBSOLETE LIST","3370-200","9970-200","Pump"]
["JABSCO OBSOLETE LIST","3370-251","9970-261","Pump"]
["JABSCO OBSOLETE LIST","3380-200","9970-200","Pump"]
["JABSCO OBSOLETE LIST","3380-221","9970-200","Pump"]
["JABSCO OBSOLETE LIST","4530-200","AL1/4-200","Pump"]
["JABSCO OBSOLETE LIST","4530-237","AL1/4-237","Pump"]
["JABSCO OBSOLETE LIST","4590-200","JD3/4-200","Pump"]
["JABSCO OBSOLETE LIST","4590-237","JD3/4-237","Pump"]
["JABSCO OBSOLETE LIST","4800-111",11790,"Pump"]
["JABSCO OBSOLETE LIST","4800-21","4800-21-01","Pump"]
["JABSCO OBSOLETE LIST","52200-2001","52200-2011","Pump"]
["JABSCO OBSOLETE LIST","5400-205","52200-2051","Pump"]
["JABSCO OBSOLETE LIST","6400-200","52200-2001","Pump"]
["JABSCO OBSOLETE LIST","6400-205","52200-2051","Pump"]
["JABSCO OBSOLETE LIST","6400-207","52200-2011","Pump"]
["JABSCO OBSOLETE LIST","6400-207","52200-2001","Pump"]
["JABSCO OBSOLETE LIST","6420-0101","52220-0011","Pump"]
["JABSCO OBSOLETE LIST","6420-200","52080-2001","Pump"]
["JABSCO OBSOLETE LIST","6420-2001","52080-2001","Pump"]
["JABSCO OBSOLETE LIST","6420-2003","52080-2003","Pump"]
["JABSCO OBSOLETE LIST","6420-204","52080-2041","Pump"]
["JABSCO OBSOLETE LIST","6420-2041","52080-2041","Pump"]
["JABSCO OBSOLETE LIST","6420-205","52080-2051","Pump"]
["JABSCO OBSOLETE LIST","6420-2051","52080-2051","Pump"]
["JABSCO OBSOLETE LIST","6520-200","51080-2001","Pump"]
["JABSCO OBSOLETE LIST","6520-2001","51080-2001","Pump"]
["JABSCO OBSOLETE LIST","6520-2003","51080-2003","Pump"]
["JABSCO OBSOLETE LIST","6520-237","51080-2001","Pump"]
["JABSCO OBSOLETE LIST","6520-251","51080-2001","Pump"]
["JABSCO OBSOLETE LIST","6590-200","51200-2011","Pump"]
["JABSCO OBSOLETE LIST","6590-237","51200-2003","Pump"]
["JABSCO OBSOLETE LIST","6640-200","52010-2001","Pump"]
["JABSCO OBSOLETE LIST","6640-205","52010-2001","Pump"]
["JABSCO OBSOLETE LIST","7420-0004","7420-0101","Pump"]
["JABSCO OBSOLETE LIST","9430-01","11650-200","Pump"]
["JABSCO OBSOLETE LIST","9430-211","29300-2601C","Pump"]
["JABSCO OBSOLETE LIST","9700-101","9700-04","Pump"]
["JABSCO OBSOLETE LIST","9700-141","9700-04","Pump"]
["JABSCO OBSOLETE LIST","9700-21","29600-1001","Pump"]
["JABSCO OBSOLETE LIST","9970-251","9970-241","Pump"]
["JABSCO OBSOLETE LIST","9970-271","9970-200","Pump"]
["JABSCO OBSOLETE LIST","9990-21","9990-41","Pump"]
["JABSCO OBSOLETE LIST","B3/8-200","6540-200","Pump"]
["JABSCO OBSOLETE LIST","2877-0001","4568-0001B","Impeller"]
["JABSCO OBSOLETE LIST","2877-0003","4568-0003B","Impeller"]
["JABSCO OBSOLETE LIST","653-0001","18653-0001B","Impeller"]
["JABSCO OBSOLETE LIST","AL24","4528-0001B","Impeller"]
["JABSCO OBSOLETE LIST","AL24-37","4528-0003B","Impeller"]
["JABSCO OBSOLETE LIST","B12-37","4527-0003B","Impeller"]
["JABSCO OBSOLETE LIST","C12","4568-0001 B","Impeller"]
["JABSCO OBSOLETE LIST","C12-37","4568-0003B","Impeller"]
["JABSCO OBSOLETE LIST","D12","4598-0001B","Impeller"]
["JABSCO OBSOLETE LIST","D12-37","4598-0003B","Impeller"]
["JABSCO OBSOLETE LIST",10135,"3625-1150","Bearing"]
["JABSCO OBSOLETE LIST","SP2600-02","SP2600-11","Bearing"]
["JABSCO OBSOLETE LIST","SP2600-0420","SP2601-42","Bearing"]
["JABSCO OBSOLETE LIST","SP2601-18","SP2600-18","Bearing"]
["JABSCO OBSOLETE LIST",22307,22317,"Bearing Housing"]
["JABSCO OBSOLETE LIST",22314,22317,"Bearing Housing"]
["JABSCO OBSOLETE LIST",22754,"22317-0010","Bearing Housing"]
["JABSCO OBSOLETE LIST","22304-0020","22304-02","Body"]
["JABSCO OBSOLETE LIST","4534-0000","AL4-200","Body"]
["JABSCO OBSOLETE LIST","4594-200","JD4-200","Body"]
["JABSCO OBSOLETE LIST","SP1095-0090","SP1095-09","Bolt"]
["JABSCO OBSOLETE LIST",9420,"934-0000","Cam"]
["JABSCO OBSOLETE LIST","4538-0000","ALB","Cam"]
["JABSCO OBSOLETE LIST","4538-0010","ALB-01","Cam"]
["JABSCO OBSOLETE LIST",3266,7884,"Cam/Wearplate"]
["JABSCO OBSOLETE LIST",3996,9336,"End Cover"]
["JABSCO OBSOLETE LIST",5522,"AL6-200","End Cover"]
["JABSCO OBSOLETE LIST","4595-200","D6-01-200","End Cover"]
["JABSCO OBSOLETE LIST",3288,3298,"Gasket"]
["JABSCO OBSOLETE LIST",5212,3298,"Gasket"]
["JABSCO OBSOLETE LIST",11417,890,"Gasket"]
["JABSCO OBSOLETE LIST","SP1401-0100","SP1401-10","Key"]
["JABSCO OBSOLETE LIST","SP1402-12",9214,"Key"]
["JABSCO OBSOLETE LIST",818,"SP2700-49","Lip Seal"]
["JABSCO OBSOLETE LIST",913,"SP2700-48","Lip Seal"]
["JABSCO OBSOLETE LIST",914,"SP2700-47","Lip Seal"]
["JABSCO OBSOLETE LIST",3214,"SP2700-59","Lip Seal"]
["JABSCO OBSOLETE LIST",11613,"SP2701-0940","Lip Seal"]
["JABSCO OBSOLETE LIST","1040-0000","SP2701-52","Lip Seal"]
["JABSCO OBSOLETE LIST","SP2700-0480","SP2700-48","Lip Seal"]
["JABSCO OBSOLETE LIST","SP2700-06","SP2701-21","Lip Seal"]
["JABSCO OBSOLETE LIST","SP2700-0910","SP2700-91","Lip Seal"]
["JABSCO OBSOLETE LIST","SP2700-11","SP2701-14","Lip Seal"]
["JABSCO OBSOLETE LIST","SP2700-14","SP2701-04","Lip Seal"]
["JABSCO OBSOLETE LIST","SP2700-18","SP2701-21","Lip Seal"]
["JABSCO OBSOLETE LIST","SP2700-28","SP2700-51","Lip Seal"]
["JABSCO OBSOLETE LIST","SP2700-90","SP2700-05","Lip Seal"]
["JABSCO OBSOLETE LIST","SP2701-07","SP2700-51","Lip Seal"]
["JABSCO OBSOLETE LIST","SP2701-18","SP2701-54","Lip Seal"]
["JABSCO OBSOLETE LIST","SP2701-48","SP2700-48","Lip Seal"]
["JABSCO OBSOLETE LIST","SP2701-49","SP2700-49","Lip Seal"]
["JABSCO OBSOLETE LIST","SP2702-80","SP2701-52","Lip Seal"]
["JABSCO OBSOLETE LIST","SP2703-02","SP2701-21","Lip Seal"]
["JABSCO OBSOLETE LIST","SP2703-07","SP2700-49","Lip Seal"]
["JABSCO OBSOLETE LIST","SP2705-05","SP2700-05","Lip Seal"]
["JABSCO OBSOLETE LIST","SP2901-18","SP2701-54","Lip Seal"]
["JABSCO OBSOLETE LIST",4548,"B18","Lock Nut"]
["JABSCO OBSOLETE LIST","4517-0000","C18","Lock Nut"]
["JABSCO OBSOLETE LIST","4548-0000","B18","Lock Nut"]
["JABSCO OBSOLETE LIST","SP1105-0030","SP1105-03","Nut"]
["JABSCO OBSOLETE LIST",4546,"B16","Packing Nut"]
["JABSCO OBSOLETE LIST","4533-0000","AL18","Packing Nut"]
["JABSCO OBSOLETE LIST","4536-0000","AL16","Packing Nut"]
["JABSCO OBSOLETE LIST","4546-0000","B16","Packing Nut"]
["JABSCO OBSOLETE LIST","4583-0000","C16","Packing Nut"]
["JABSCO OBSOLETE LIST",4549,"B22","Packing Ring"]
["JABSCO OBSOLETE LIST","4518-0000","C20","Packing Ring"]
["JABSCO OBSOLETE LIST","4539-0000","AL22","Packing Ring"]
["JABSCO OBSOLETE LIST","4549-0000","B22","Packing Ring"]
["JABSCO OBSOLETE LIST","SP1700-2470","SP1700-247","Retaining Ring"]
["JABSCO OBSOLETE LIST","SP1002-07","SP1002-02","Screw"]
["JABSCO OBSOLETE LIST","SP1003-0090","SP1003-09","Screw"]
["JABSCO OBSOLETE LIST","SP1004-0090","SP1004-09","Screw"]
["JABSCO OBSOLETE LIST","SP1009-08","SP1009-05","Screw"]
["JABSCO OBSOLETE LIST","SP1023-0050","91023-0050","Screw"]
["JABSCO OBSOLETE LIST","SP2700-66","92700-0660","Seal"]
["JABSCO OBSOLETE LIST",410,21849,"Seal Assembly"]
["JABSCO OBSOLETE LIST",686,21849,"Seal Assembly"]
["JABSCO OBSOLETE LIST",833,21849,"Seal Assembly"]
["JABSCO OBSOLETE LIST",2577,21849,"Seal Assembly"]
["JABSCO OBSOLETE LIST",6408,21849,"Seal Assembly"]
["JABSCO OBSOLETE LIST",10118,"1817-0000","Seal Assembly"]
["JABSCO OBSOLETE LIST",21944,"22644-6000","Seal Assembly"]
["JABSCO OBSOLETE LIST","22617-0000","22617-0010","Seal Assembly"]
["JABSCO OBSOLETE LIST","SP6080-0070","22617-0010","Seal Assembly"]
["JABSCO OBSOLETE LIST","SP6080-03","SP6080-10","Seal Assembly"]
["JABSCO OBSOLETE LIST","SP6080-0372",21849,"Seal Assembly"]
["JABSCO OBSOLETE LIST","SP6080-0373","22626-0000","Seal Assembly"]
["JABSCO OBSOLETE LIST","SP6080-07","22617-0010","Seal Assembly"]
["JABSCO OBSOLETE LIST","SP6080-07B","22617-0010","Seal Assembly"]
["JABSCO OBSOLETE LIST","SP6080-11","22642-0000","Seal Assembly"]
["JABSCO OBSOLETE LIST","SP6080-24","22643-0000","Seal Assembly"]
["JABSCO OBSOLETE LIST","SP8022-0070","22617-0010","Seal Assembly"]
["JABSCO OBSOLETE LIST","SP8022-07","22617-0010","Seal Assembly"]
["JABSCO OBSOLETE LIST","SP8033-0161","22644-6000","Seal Assembly"]
["JABSCO OBSOLETE LIST",4511,9364,"Seal Ring"]
["JABSCO OBSOLETE LIST",6406,10163,"Seal Seat"]
["JABSCO OBSOLETE LIST",6718,"6718-21","Shaft"]
["JABSCO OBSOLETE LIST",10497,11258,"Shaft"]
["JABSCO OBSOLETE LIST",11253,11254,"Shaft"]
["JABSCO OBSOLETE LIST",11256,11258,"Shaft"]
["JABSCO OBSOLETE LIST",11788,"11749-0000","Shaft"]
["JABSCO OBSOLETE LIST",21374,9527,"Shaft"]
["JABSCO OBSOLETE LIST",21677,"21679-0000","Shaft"]
["JABSCO OBSOLETE LIST",22287,22286,"Shaft"]
["JABSCO OBSOLETE LIST","10187-01","21679-0010","Shaft"]
["JABSCO OBSOLETE LIST","10497-01","11258-01","Shaft"]
["JABSCO OBSOLETE LIST","10657-0040","10657-0020","Shaft"]
["JABSCO OBSOLETE LIST","10657-0050","10657-0030","Shaft"]
["JABSCO OBSOLETE LIST","10677-0040","10677-0020","Shaft"]
["JABSCO OBSOLETE LIST","10677-0050","10677-0030","Shaft"]
["JABSCO OBSOLETE LIST","11253-01","11254-01","Shaft"]
["JABSCO OBSOLETE LIST","11256-01","11258-01","Shaft"]
["JABSCO OBSOLETE LIST","11493-01","11494-01","Shaft"]
["JABSCO OBSOLETE LIST","11796-0020","11796-0010","Shaft"]
["JABSCO OBSOLETE LIST","21677-01","21679-0010","Shaft"]
["JABSCO OBSOLETE LIST","355-24","355-07-24","Shaft"]
["JABSCO OBSOLETE LIST","4537-0000","AL10","Shaft"]
["JABSCO OBSOLETE LIST","4547-01","D10-01","Shaft"]
["JABSCO OBSOLETE LIST","4567-01","C10-01","Shaft"]
["JABSCO OBSOLETE LIST","688-21","688-21-24","Shaft"]
["JABSCO OBSOLETE LIST","9436-211",22286,"Shaft"]
["JABSCO OBSOLETE LIST","C10","C10-01","Shaft"]
["JABSCO OBSOLETE LIST","D10","D10-01","Shaft"]
["JABSCO OBSOLETE LIST",7447,3166,"Spacer"]
["JABSCO OBSOLETE LIST","SP1602-0060","SP1602-06","Washer"]
["JABSCO OBSOLETE LIST",8123,4357,"Wearplate"]
["JABSCO OBSOLETE LIST",9416,4156,"Wearplate"]
["JABSCO OBSOLETE LIST",9996,7883,"Wearplate"]
["SERVICE LIST ADD","B 3/8\"-200","6540-200"]
["SERVICE LIST ADD","JD 3/4\"-201","JD 3/4\"- 200"]
["SERVICE LIST ADD","JD 3/4\"-208","JD 3/4\"- 200"]
["SERVICE LIST ADD",4850,9750]
["SERVICE LIST ADD",4860,9760]
["SERVICE LIST ADD","6490-252","6490-222"]
["SERVICE LIST ADD","6490-253","6490-223"]
["SERVICE LIST ADD","9040-0511","now-1021"]
["SERVICE LIST ADD",9430,"Exhaust Cooling"]
["SERVICE LIST ADD",9710,"9710-200"]
["SERVICE LIST ADD",9900,"29470-\n2231C"]
["SERVICE LIST ADD","9970-241","Direct Cooling"]
["SERVICE LIST ADD","9970-2S1","9970-241"]
["SERVICE LIST ADD",10490,"52270-\n0011"]
["SERVICE LIST ADD","10490-0201","50270-\n0911"]
["SERVICE LIST ADD","10490-07","52270-\n0011"]
["SERVICE LIST ADD","10490-207","52270-\n0011"]
["SERVICE LIST ADD",10590,"10590-22"]
["SERVICE LIST ADD","10590-0031","10590-\n0111"]
["SERVICE LIST ADD","10590-0041","10590-\n0111"]
["SERVICE LIST ADD","10590-01","11101-01-\n01"]
["SERVICE LIST ADD","10590-0141","10590-\n0041"]
["SERVICE LIST ADD","10590-0201","10590-\n0111"]
["SERVICE LIST ADD","10590-21","10590-22"]
["SERVICE LIST ADD","10590-22","10590-\n0111"]
["SERVICE LIST ADD","10590-61","10590-62"]
["SERVICE LIST ADD",10630,"52220-\n0011"]
["SERVICE LIST ADD","10630-01","52220-\n0011"]
["SERVICE LIST ADD","10630-07","52220-\n0011"]
["SERVICE LIST ADD","10630-200","52220-\n0011"]
["SERVICE LIST ADD","10630-207","52220-\n0011"]
["SERVICE LIST ADD","10630-57","52220-\n0011"]
["SERVICE LIST ADD",10650,"51220-\n0011"]
["SERVICE LIST ADD","10650-200","51200-\n2011"]
["SERVICE LIST ADD",10660,"51270-\n0011"]
["SERVICE LIST ADD","10660-200","51270-\n2011"]
["SERVICE LIST ADD",10670,"50220-\n0011"]
["SERVICE LIST ADD","10670-01","50220-\n0111"]
["SERVICE LIST ADD","10670-10","50220-\n0211"]
["SERVICE LIST ADD","10670-11","50220-\n0311"]
["SERVICE LIST ADD","10670-200","50200-\n2011"]
["SERVICE LIST ADD","10670-201","50200-\n2111"]
["SERVICE LIST ADD","10670-210","50200-\n2211"]
["SERVICE LIST ADD","10670-211","50200-\n2311"]
["SERVICE LIST ADD",10680,"50270-\n0011"]
["SERVICE LIST ADD","10680-01","50270-\n0111"]
["SERVICE LIST ADD","10680-10","50270-\n0211"]
["SERVICE LIST ADD","10680-11","50270-\n0311"]
["SERVICE LIST ADD","10680-200","50270-\n2011"]
["SERVICE LIST ADD","10680-201","50270-\n2111"]
["SERVICE LIST ADD","10680-210","50270-\n2211"]
["SERVICE LIST ADD","10680-211","50270-\n2311"]
["SERVICE LIST ADD","10880-2461","10880-\n2561"]
["SERVICE LIST ADD","10950-200","10950-\n2401"]
["SERVICE LIST ADD","10950-201","10950-\n2401"]
["SERVICE LIST ADD","10950-204","10950-\n2401"]
["SERVICE LIST ADD","10950-205","10950-\n2401"]
["SERVICE LIST ADD","10950-2101","10950-\n2401"]
["SERVICE LIST ADD","10950-2141","10950-\n2401"]
["SERVICE LIST ADD","10950-2201","10950-\n2601"]
["SERVICE LIST ADD","10950-2241","10950-\n2601"]
["SERVICE LIST ADD","10950-2441","10950-\n2601"]
["SERVICE LIST ADD","10950-2451","10950-\n2601"]
["SERVICE LIST ADD","10950-2701","10950-\n2401"]
["SERVICE LIST ADD","10980-01","10980-\n0051"]
["SERVICE LIST ADD","11260-200","29300-\n2101C"]
["SERVICE LIST ADD","11260-205","29300-\n2151C"]
["SERVICE LIST ADD","11260-2101","29300-\n2201C"]
["SERVICE LIST ADD","11260-2151","29300-\n2151C"]
["SERVICE LIST ADD","11410-200","Bilge"]
["SERVICE LIST ADD","11410-200","Cooling"]
["SERVICE LIST ADD","11470-200","Bilge"]
["SERVICE LIST ADD","11470-200","Cooling"]
["SERVICE LIST ADD","11570-200","Bilge"]
["SERVICE LIST ADD","11570-200","Cooling"]
["SERVICE LIST ADD","11590-204","Bilge"]
["SERVICE LIST ADD","11590-204","Cooling"]
["SERVICE LIST ADD","11620-200","22830-\n2101"]
["SERVICE LIST ADD","11740-200","Bilge"]
["SERVICE LIST ADD","11740-200","Cooling"]
["SERVICE LIST ADD","11740-205","Bilge"]
["SERVICE LIST ADD","11740-205","Cooling"]
["SERVICE LIST ADD","11850-0101","11850-\n0701"]
["SERVICE LIST ADD","17200-0001","18930-\n0010"]
["SERVICE LIST ADD","17410-0001","18830-\n1020"]
["SERVICE LIST ADD","21080-200","Bilge"]
["SERVICE LIST ADD","21080-200","Cooling"]
["SERVICE LIST ADD","21080-204","Bilge"]
["SERVICE LIST ADD","21080-204","Cooling"]
["SERVICE LIST ADD","21090-200","21090-204"]
["SERVICE LIST ADD","21130-200","21130-\n2101"]
["SERVICE LIST ADD","21130-200","21130-\n2101"]
["SERVICE LIST ADD","21130-2101","Bilge"]
["SERVICE LIST ADD","21130-2101","Cooling"]
["SERVICE LIST ADD","21140-200","21140-\n2401"]
["SERVICE LIST ADD","21140-201","21140-\n2401"]
["SERVICE LIST ADD","21140-204","21140-\n2401"]
["SERVICE LIST ADD","21140-2101","21140-\n2601"]
["SERVICE LIST ADD","21140-2141","21140-\n2601"]
["SERVICE LIST ADD","21140-2201","21140-\n2601"]
["SERVICE LIST ADD","21140-2241","21140-\n2601"]
["SERVICE LIST ADD","21190-200","Bilge"]
["SERVICE LIST ADD","21190-200","Cooling"]
["SERVICE LIST ADD","21820-200","52040-\n2001"]
["SERVICE LIST ADD","21820-2001","52040-\n2001"]
["SERVICE LIST ADD","21820-2003","52040-\n2003"]
["SERVICE LIST ADD","21820-2021","52040-\n2021"]
["SERVICE LIST ADD","21880-200","Bilge"]
["SERVICE LIST ADD","21880-200","Cooling"]
["SERVICE LIST ADD","21880-205","Bilge"]
["SERVICE LIST ADD","21880-205","Cooling"]
["SERVICE LIST ADD",21890,"10880-\n2611"]
["SERVICE LIST ADD","21960-200","50080-\n2001"]
["SERVICE LIST ADD","21960-210","50080-\n2101"]
["SERVICE LIST ADD","21960-211","50080-\n2201"]
["SERVICE LIST ADD","21960-221","50080-\n2301"]
["SERVICE LIST ADD","22040-0131","22040-\n0501"]
["SERVICE LIST ADD","22230-200","Salt Water"]
["SERVICE LIST ADD","22230-200","Fresh Water"]
["SERVICE LIST ADD",22240,"Salt Water"]
["SERVICE LIST ADD",22240,"Fresh Water"]
["SERVICE LIST ADD","22300-05","22740-\n0351"]
["SERVICE LIST ADD","22350-200","Salt Water"]
["SERVICE LIST ADD","22350-200","Fresh Water"]
["SERVICE LIST ADD",22360,"Salt Water"]
["SERVICE LIST ADD",22360,"Fresh Water"]
["SERVICE LIST ADD",22620,"29440-\n1101"]
["SERVICE LIST ADD","22690-200","Salt Water"]
["SERVICE LIST ADD","22690-200","Fresh Water"]
["SERVICE LIST ADD","22740-0251","22740-\n0151"]
["SERVICE LIST ADD","22740-0301","22740-\n0201"]
["SERVICE LIST ADD","22750-05","22750-\n1101"]
["SERVICE LIST ADD",22770,"29440-\n1001"]
["SERVICE LIST ADD","22770-1051","29440-\n1051"]
["SERVICE LIST ADD","22770-1101","29440-\n1101"]
["SERVICE LIST ADD","22790-1001","Salt Water"]
["SERVICE LIST ADD","22790-1001","Fresh Water"]
["SERVICE LIST ADD","22940-2001","52010-\n2001"]
["SERVICE LIST ADD","22950-2031","52020-\n2001"]
["SERVICE LIST ADD","22950-2037","52020-\n2001"]
["SERVICE LIST ADD","23010-0131","Bilge"]
["SERVICE LIST ADD","23010-0131","Cooling"]
["SERVICE LIST ADD","23010-0501","Bilge"]
["SERVICE LIST ADD","23010-0501","Cooling"]
["SERVICE LIST ADD","23010-0531","Bilge"]
["SERVICE LIST ADD","23010-0531","Cooling"]
["SERVICE LIST ADD","23060-1101","Bilge"]
["SERVICE LIST ADD","23060-1101","Cooling"]
["SERVICE LIST ADD","23320-2101","New Pipework"]
["SERVICE LIST ADD","23340-1101","Respecified"]
["SERVICE LIST ADD","23800-0201","50410-\n1201"]
["SERVICE LIST ADD","23800-0201","50410-\n1201"]
["SERVICE LIST ADD","23800-0251","50410-\n1251"]
["SERVICE LIST ADD","23800-0251","50410-\n1251"]
["SERVICE LIST ADD","23800-0301","50410-\n1301"]
["SERVICE LIST ADD","23800-0351","50410-\n1351"]
["SERVICE LIST ADD","23800-0351","50410-\n1401"]
["SERVICE LIST ADD","29460-1041*","29460-10-\n1041"]
["SERVICE LIST ADD","29460-1051*","29460-10-\n1051"]
["SERVICE LIST ADD","29500-1351","New Pipework"]
["SERVICE LIST ADD","29500-3001","29500-\n1001"]
["SERVICE LIST ADD","29600-1001","New Pipework"]
["SERVICE LIST ADD","29630-1001","29640-\n1101"]
["SERVICE LIST ADD","29630-1101","29630-\n1201"]
["SERVICE LIST ADD","29630-1141","29630-\n1241"]
["SERVICE LIST ADD","29850-0031","29880-\n0001"]
["SERVICE LIST ADD","29860-2201","SK412- 0001"]
["SERVICE LIST ADD","29880-0001","Respecified"]
["SERVICE LIST ADD","29880-0101","29890-\n0101"]
["SERVICE LIST ADD","43210-0001","Cooling"]
["SERVICE LIST ADD","50370-1001","50370-\n2001"]
["SERVICE LIST ADD","51080-2003","51080-\n2001"]
["SERVICE LIST ADD","51200-2003","Bilge Option"]
["SERVICE LIST ADD","51200-2011","Bilge Option"]
["SERVICE LIST ADD","52010-2001","51510-\n2001"]
["SERVICE LIST ADD","52010-2051","51510-\n2001"]
["SERVICE LIST ADD","52020-2001","51520-\n2001"]
["SERVICE LIST ADD","52020-2031","51520-\n2001"]
["SERVICE LIST ADD","52020-2051","51520-\n2001"]
["SERVICE LIST ADD","52200-2001","S2200- 2011"]
["LAB","2574","2574-0000"]
["LAB","834","834-0001"]